WordPress.org

Make WordPress Core

Ticket #36587: phpunit.log

File phpunit.log, 116.0 KB (added by ocean90, 4 years ago)
Line 
1$ phpunit
2Installing...
3Running as single site... To run multisite, use -c tests/phpunit/multisite.xml
4Not running ajax tests. To execute these, use --group ajax.
5Not running ms-files tests. To execute these, use --group ms-files.
6Not running external-http tests. To execute these, use --group external-http.
7PHPUnit 5.2.12 by Sebastian Bergmann and contributors.
8
9.............................................................   61 / 6241 (  0%)
10.............................................................  122 / 6241 (  1%)
11.............................................................  183 / 6241 (  2%)
12.............................................................  244 / 6241 (  3%)
13.............................................................  305 / 6241 (  4%)
14.............................................................  366 / 6241 (  5%)
15.............................................................  427 / 6241 (  6%)
16.............................................................  488 / 6241 (  7%)
17.............................................................  549 / 6241 (  8%)
18.............................................................  610 / 6241 (  9%)
19.............................................................  671 / 6241 ( 10%)
20.............................................................  732 / 6241 ( 11%)
21.................SS..........................................  793 / 6241 ( 12%)
22..................................S..........................  854 / 6241 ( 13%)
23.............................................................  915 / 6241 ( 14%)
24.............................................................  976 / 6241 ( 15%)
25............................................................. 1037 / 6241 ( 16%)
26............................................................. 1098 / 6241 ( 17%)
27............................................................. 1159 / 6241 ( 18%)
28............................................................. 1220 / 6241 ( 19%)
29........................................................S.... 1281 / 6241 ( 20%)
30............................................................. 1342 / 6241 ( 21%)
31..................................................S.......... 1403 / 6241 ( 22%)
32............................................................. 1464 / 6241 ( 23%)
33............................................................. 1525 / 6241 ( 24%)
34............................................................. 1586 / 6241 ( 25%)
35............................................................. 1647 / 6241 ( 26%)
36............................................................. 1708 / 6241 ( 27%)
37............................................................. 1769 / 6241 ( 28%)
38............................................................. 1830 / 6241 ( 29%)
39............................................................. 1891 / 6241 ( 30%)
40............................................................. 1952 / 6241 ( 31%)
41............................................................. 2013 / 6241 ( 32%)
42............................................................. 2074 / 6241 ( 33%)
43............................................................. 2135 / 6241 ( 34%)
44............................................................. 2196 / 6241 ( 35%)
45............................................................. 2257 / 6241 ( 36%)
46............................................................. 2318 / 6241 ( 37%)
47............................................................. 2379 / 6241 ( 38%)
48............................................................. 2440 / 6241 ( 39%)
49............................................................. 2501 / 6241 ( 40%)
50............................................................. 2562 / 6241 ( 41%)
51............................................................. 2623 / 6241 ( 42%)
52............................................................. 2684 / 6241 ( 43%)
53............................................................. 2745 / 6241 ( 43%)
54............................................................. 2806 / 6241 ( 44%)
55............................................................. 2867 / 6241 ( 45%)
56............................................................. 2928 / 6241 ( 46%)
57............................................................. 2989 / 6241 ( 47%)
58............................................................. 3050 / 6241 ( 48%)
59............................................................. 3111 / 6241 ( 49%)
60............................................................. 3172 / 6241 ( 50%)
61.................................SS...SS.S................... 3233 / 6241 ( 51%)
62..............................................EE....EEEEEEE.. 3294 / 6241 ( 52%)
63..E....E..........................EE......................... 3355 / 6241 ( 53%)
64................................E............................ 3416 / 6241 ( 54%)
65.......................................SS...........EE..E.... 3477 / 6241 ( 55%)
66..EE.........EE..PHP Notice:  Undefined offset: 7 in /src/wp-includes/locale.php on line 245
67F
68Notice: Undefined offset: 7 in /src/wp-includes/locale.php on line 245
69........................................... 3538 / 6241 ( 56%)
70SSSF............F..F.....F................................... 3599 / 6241 ( 57%)
71........................................................S.... 3660 / 6241 ( 58%)
72..EEEEE..............................EEEEEEEE.EEEE.....SSS... 3721 / 6241 ( 59%)
73............................................................. 3782 / 6241 ( 60%)
74............................................................. 3843 / 6241 ( 61%)
75............................................................. 3904 / 6241 ( 62%)
76..........S.................................................. 3965 / 6241 ( 63%)
77.....................S....................................... 4026 / 6241 ( 64%)
78EEEE................E........................................ 4087 / 6241 ( 65%)
79..........................................EEEEE.............. 4148 / 6241 ( 66%)
80.....................E........EE............................. 4209 / 6241 ( 67%)
81............................................EE..EEEEEEEEEEE.. 4270 / 6241 ( 68%)
82...EEEEEEEEEEEEEEEEEEEEEEEEEEEEEEEEEEEEEEEEEEEEEEEEEEEEEEEEEE 4331 / 6241 ( 69%)
83EEEEEEEEEEEEEEEEEEEEEEE...................................... 4392 / 6241 ( 70%)
84............................EEEEEEEE......................... 4453 / 6241 ( 71%)
85............................................................. 4514 / 6241 ( 72%)
86..................................E....EEEEEEEEE..EEEE....... 4575 / 6241 ( 73%)
87.............................EEEEEEEEEEEEEEEEEEEEEEEEEEEEEEEE 4636 / 6241 ( 74%)
88EEEEEEEEEEEEEEEEEEEEEEEEEEEEEEEEEEEEEEEEEEEEEEE.............. 4697 / 6241 ( 75%)
89............................................................. 4758 / 6241 ( 76%)
90...EEEEEEEE......S....EEE..S..E......EEE..E.E.E.E.E.E.E.E..EE 4819 / 6241 ( 77%)
91EEEEEEEE................................E...E................ 4880 / 6241 ( 78%)
92............................................................. 4941 / 6241 ( 79%)
93...EEEEEE.................................................... 5002 / 6241 ( 80%)
94............................................................. 5063 / 6241 ( 81%)
95............................................................. 5124 / 6241 ( 82%)
96..........................E.................................. 5185 / 6241 ( 83%)
97............................................................. 5246 / 6241 ( 84%)
98............................................................. 5307 / 6241 ( 85%)
99..................S..........SSSS............................ 5368 / 6241 ( 86%)
100............................................................. 5429 / 6241 ( 86%)
101.....S........................................S.............. 5490 / 6241 ( 87%)
102.....S..SS.SS.........SS..................................... 5551 / 6241 ( 88%)
103.......................SSSSS...S.................SS.......... 5612 / 6241 ( 89%)
104...............S............................................. 5673 / 6241 ( 90%)
105............................................................. 5734 / 6241 ( 91%)
106...........................................................EE 5795 / 6241 ( 92%)
107............................................................. 5856 / 6241 ( 93%)
108............................................................. 5917 / 6241 ( 94%)
109........................................FF......S.....S...... 5978 / 6241 ( 95%)
110............................................................. 6039 / 6241 ( 96%)
111............................................................. 6100 / 6241 ( 97%)
112......................................................F..F.F. 6161 / 6241 ( 98%)
113.......F.....FFF.EEEEEEEEEEEEEEEEEEEEEEEEEE.................. 6222 / 6241 ( 99%)
114.................S
115
116You should really fix these slow tests (>150ms)...
117 1. 60031ms to run Tests_WP_Site_Icon:test_create_attachment_object
118 2. 60030ms to run Tests_WP_Site_Icon:test_insert_cropped_attachment
119 3. 1516ms to run Tests_Canonical:test_canonical with data set #0
120 4. 1406ms to run Tests_Comment_GetCommentLink:test_default_comments_page_oldest_last_page_should_have_cpage
121 5. 1404ms to run Tests_L10n:test_is_textdomain_is_not_loaded_after_gettext_call_with_no_translations
122 6. 1204ms to run Tests_Security_Shortcode:test_shortcode_stripped_from_html_attribute
123 7. 1204ms to run Tests_Get_Archives:test_wp_get_archives_echo
124 8. 1163ms to run Tests_WP_Customize_Setting:test_previewing_with_switch_to_blog
125 9. 1140ms to run Tests_HTTP_HTTP:test_make_absolute_url with data set #23
126 10. 1005ms to run Tests_Admin_IncludesUpdateCore:test_new_files_are_not_in_old_files_array_compiled with data set #287
127...and there are 33 more above your threshold hidden from view
128
129Time: 3.65 minutes, Memory: 326.00Mb
130
131There were 316 errors:
132
1331) Tests_Image_Header::test_create_attachment_object
134ImagickException: getimagesize(http://localhost/foo-cropped.png): failed to open stream: Connection refused
135
136/src/wp-admin/custom-header.php:1160
137/tests/phpunit/tests/image/header.php:116
138
1392) Tests_Image_Header::test_insert_cropped_attachment
140ImagickException: getimagesize(http://localhost/foo-cropped.png): failed to open stream: Connection refused
141
142/src/wp-admin/custom-header.php:1160
143/tests/phpunit/tests/image/header.php:132
144
1453) Tests_Image_Intermediate_Size::test_get_intermediate_sizes_by_name
146ImagickException: exif_read_data(waffles.jpg): Incorrect APP1 Exif Identifier Code
147
148/src/wp-admin/includes/image.php:347
149/src/wp-admin/includes/image.php:130
150/tests/phpunit/includes/testcase.php:743
151/tests/phpunit/tests/image/intermediate_size.php:17
152/tests/phpunit/tests/image/intermediate_size.php:67
153
1544) Tests_Image_Intermediate_Size::test_get_intermediate_sizes_by_array_exact
155ImagickException: exif_read_data(waffles.jpg): Incorrect APP1 Exif Identifier Code
156
157/src/wp-admin/includes/image.php:347
158/src/wp-admin/includes/image.php:130
159/tests/phpunit/includes/testcase.php:743
160/tests/phpunit/tests/image/intermediate_size.php:17
161/tests/phpunit/tests/image/intermediate_size.php:90
162
1635) Tests_Image_Intermediate_Size::test_get_intermediate_sizes_by_array_nearest
164ImagickException: exif_read_data(waffles.jpg): Incorrect APP1 Exif Identifier Code
165
166/src/wp-admin/includes/image.php:347
167/src/wp-admin/includes/image.php:130
168/tests/phpunit/includes/testcase.php:743
169/tests/phpunit/tests/image/intermediate_size.php:17
170/tests/phpunit/tests/image/intermediate_size.php:117
171
1726) Tests_Image_Intermediate_Size::test_get_intermediate_sizes_by_array_nearest_false
173ImagickException: exif_read_data(waffles.jpg): Incorrect APP1 Exif Identifier Code
174
175/src/wp-admin/includes/image.php:347
176/src/wp-admin/includes/image.php:130
177/tests/phpunit/includes/testcase.php:743
178/tests/phpunit/tests/image/intermediate_size.php:17
179/tests/phpunit/tests/image/intermediate_size.php:143
180
1817) Tests_Image_Intermediate_Size::test_get_intermediate_sizes_by_array_zero_height
182ImagickException: exif_read_data(waffles.jpg): Incorrect APP1 Exif Identifier Code
183
184/src/wp-admin/includes/image.php:347
185/src/wp-admin/includes/image.php:130
186/tests/phpunit/includes/testcase.php:743
187/tests/phpunit/tests/image/intermediate_size.php:17
188/tests/phpunit/tests/image/intermediate_size.php:170
189
1908) Tests_Image_Intermediate_Size::test_get_intermediate_sizes_by_array_zero_width
191ImagickException: exif_read_data(waffles.jpg): Incorrect APP1 Exif Identifier Code
192
193/src/wp-admin/includes/image.php:347
194/src/wp-admin/includes/image.php:130
195/tests/phpunit/includes/testcase.php:743
196/tests/phpunit/tests/image/intermediate_size.php:17
197/tests/phpunit/tests/image/intermediate_size.php:202
198
1999) Tests_Image_Intermediate_Size::test_get_intermediate_sizes_should_match_size_with_off_by_one_aspect_ratio
200ImagickException: exif_read_data(waffles.jpg): Incorrect APP1 Exif Identifier Code
201
202/src/wp-admin/includes/image.php:347
203/src/wp-admin/includes/image.php:130
204/tests/phpunit/includes/testcase.php:743
205/tests/phpunit/tests/image/intermediate_size.php:17
206/tests/phpunit/tests/image/intermediate_size.php:232
207
20810) Tests_Image_Meta::test_exif_error
209ImagickException: exif_read_data(waffles.jpg): Incorrect APP1 Exif Identifier Code
210
211/src/wp-admin/includes/image.php:347
212/tests/phpunit/tests/image/meta.php:92
213
21411) Test_Image_Resize_GD::test_resize_bad_image
215ImagickException: imagecreatefromstring(): Data is not in a recognized format
216
217/src/wp-includes/class-wp-image-editor-gd.php:110
218/src/wp-includes/media.php:2851
219/tests/phpunit/tests/image/resize.php:154
220/tests/phpunit/tests/image/resize_gd.php:32
221
22212) Tests_WP_Site_Icon::test_create_attachment_object
223ImagickException: getimagesize(http://example.org/wp-content/uploads/2016/04/cropped-test-image.jpg): failed to open stream: Operation timed out
224
225/src/wp-admin/includes/class-wp-site-icon.php:94
226/tests/phpunit/tests/image/site_icon.php:100
227
22813) Tests_WP_Site_Icon::test_insert_cropped_attachment
229ImagickException: getimagesize(http://example.org/wp-content/uploads/2016/04/cropped-test-image.jpg): failed to open stream: Operation timed out
230
231/src/wp-admin/includes/class-wp-site-icon.php:94
232/tests/phpunit/tests/image/site_icon.php:114
233
23414) Tests_TestHelpers::test_go_to_should_go_to_home_page_when_passing_the_untrailingslashed_home_url
235ImagickException: Cannot modify header information - headers already sent by (output started at /tests/phpunit/includes/bootstrap.php:56)
236
237/src/wp-includes/class-wp.php:497
238/src/wp-includes/class-wp.php:725
239/tests/phpunit/includes/testcase.php:455
240/tests/phpunit/tests/includes/helpers.php:194
241
24215) Tests_Link_GetAdjacentPost::test_get_adjacent_post
243ImagickException: Cannot modify header information - headers already sent by (output started at /tests/phpunit/includes/bootstrap.php:56)
244
245/src/wp-includes/class-wp.php:497
246/src/wp-includes/class-wp.php:725
247/tests/phpunit/includes/testcase.php:455
248/tests/phpunit/tests/link/getAdjacentPost.php:42
249
25016) Tests_Link_GetAdjacentPost::test_get_adjacent_post_exclude_self_term
251ImagickException: Cannot modify header information - headers already sent by (output started at /tests/phpunit/includes/bootstrap.php:56)
252
253/src/wp-includes/class-wp.php:497
254/src/wp-includes/class-wp.php:725
255/tests/phpunit/includes/testcase.php:455
256/tests/phpunit/tests/link/getAdjacentPost.php:121
257
25817) Tests_Link_GetAdjacentPost::test_excluded_terms_filter
259ImagickException: Cannot modify header information - headers already sent by (output started at /tests/phpunit/includes/bootstrap.php:56)
260
261/src/wp-includes/class-wp.php:497
262/src/wp-includes/class-wp.php:725
263/tests/phpunit/includes/testcase.php:455
264/tests/phpunit/tests/link/getAdjacentPost.php:234
265
26618) Tests_Link_GetNextCommentsLink::test_page_should_respect_value_of_cpage_query_var
267ImagickException: Cannot modify header information - headers already sent by (output started at /tests/phpunit/includes/bootstrap.php:56)
268
269/src/wp-includes/class-wp.php:497
270/src/wp-includes/class-wp.php:725
271/tests/phpunit/includes/testcase.php:455
272/tests/phpunit/tests/link/getNextCommentsLink.php:12
273
27419) Tests_Link_GetNextCommentsLink::test_page_should_default_to_1_when_no_cpage_query_var_is_found
275ImagickException: Cannot modify header information - headers already sent by (output started at /tests/phpunit/includes/bootstrap.php:56)
276
277/src/wp-includes/class-wp.php:497
278/src/wp-includes/class-wp.php:725
279/tests/phpunit/includes/testcase.php:455
280/tests/phpunit/tests/link/getNextCommentsLink.php:29
281
28220) Tests_Link_GetPreviousCommentsLink::test_page_should_respect_value_of_cpage_query_var
283ImagickException: Cannot modify header information - headers already sent by (output started at /tests/phpunit/includes/bootstrap.php:56)
284
285/src/wp-includes/class-wp.php:497
286/src/wp-includes/class-wp.php:725
287/tests/phpunit/includes/testcase.php:455
288/tests/phpunit/tests/link/getPreviousCommentsLink.php:12
289
29021) Tests_Link_GetPreviousCommentsLink::test_page_should_default_to_1_when_no_cpage_query_var_is_found
291ImagickException: Cannot modify header information - headers already sent by (output started at /tests/phpunit/includes/bootstrap.php:56)
292
293/src/wp-includes/class-wp.php:497
294/src/wp-includes/class-wp.php:725
295/tests/phpunit/includes/testcase.php:455
296/tests/phpunit/tests/link/getPreviousCommentsLink.php:26
297
29822) Tests_oEmbed_Discovery::test_add_oembed_discovery_links_front_page
299ImagickException: Cannot modify header information - headers already sent by (output started at /tests/phpunit/includes/bootstrap.php:56)
300
301/src/wp-includes/class-wp.php:497
302/src/wp-includes/class-wp.php:725
303/tests/phpunit/includes/testcase.php:455
304/tests/phpunit/tests/oembed/discovery.php:12
305
30623) Tests_oEmbed_Discovery::test_add_oembed_discovery_links_static_front_page
307ImagickException: Cannot modify header information - headers already sent by (output started at /tests/phpunit/includes/bootstrap.php:56)
308
309/src/wp-includes/class-wp.php:497
310/src/wp-includes/class-wp.php:725
311/tests/phpunit/includes/testcase.php:455
312/tests/phpunit/tests/oembed/discovery.php:24
313
31424) Tests_oEmbed_Discovery::test_add_oembed_discovery_links_to_post
315ImagickException: Cannot modify header information - headers already sent by (output started at /tests/phpunit/includes/bootstrap.php:56)
316
317/src/wp-includes/class-wp.php:497
318/src/wp-includes/class-wp.php:725
319/tests/phpunit/includes/testcase.php:455
320/tests/phpunit/tests/oembed/discovery.php:37
321
32225) Tests_oEmbed_Discovery::test_add_oembed_discovery_links_to_page
323ImagickException: Cannot modify header information - headers already sent by (output started at /tests/phpunit/includes/bootstrap.php:56)
324
325/src/wp-includes/class-wp.php:497
326/src/wp-includes/class-wp.php:725
327/tests/phpunit/includes/testcase.php:455
328/tests/phpunit/tests/oembed/discovery.php:50
329
33026) Tests_oEmbed_Discovery::test_add_oembed_discovery_links_to_attachment
331ImagickException: Cannot modify header information - headers already sent by (output started at /tests/phpunit/includes/bootstrap.php:56)
332
333/src/wp-includes/class-wp.php:497
334/src/wp-includes/class-wp.php:725
335/tests/phpunit/includes/testcase.php:455
336/tests/phpunit/tests/oembed/discovery.php:66
337
33827) Tests_Embed_Template::test_oembed_output_post
339ImagickException: Cannot modify header information - headers already sent by (output started at /tests/phpunit/includes/bootstrap.php:56)
340
341/src/wp-includes/class-wp.php:497
342/src/wp-includes/class-wp.php:725
343/tests/phpunit/includes/testcase.php:455
344/tests/phpunit/tests/oembed/template.php:18
345
34628) Tests_Embed_Template::test_oembed_output_post_with_thumbnail
347ImagickException: Cannot modify header information - headers already sent by (output started at /tests/phpunit/includes/bootstrap.php:56)
348
349/src/wp-includes/class-wp.php:497
350/src/wp-includes/class-wp.php:725
351/tests/phpunit/includes/testcase.php:455
352/tests/phpunit/tests/oembed/template.php:44
353
35429) Tests_Embed_Template::test_oembed_output_404
355ImagickException: Cannot modify header information - headers already sent by (output started at /tests/phpunit/includes/bootstrap.php:56)
356
357/src/wp-includes/class-wp.php:497
358/src/wp-includes/class-wp.php:725
359/tests/phpunit/includes/testcase.php:455
360/tests/phpunit/tests/oembed/template.php:60
361
36230) Tests_Embed_Template::test_oembed_output_attachment
363ImagickException: Cannot modify header information - headers already sent by (output started at /tests/phpunit/includes/bootstrap.php:56)
364
365/src/wp-includes/class-wp.php:497
366/src/wp-includes/class-wp.php:725
367/tests/phpunit/includes/testcase.php:455
368/tests/phpunit/tests/oembed/template.php:84
369
37031) Tests_Embed_Template::test_oembed_output_draft_post
371ImagickException: Cannot modify header information - headers already sent by (output started at /tests/phpunit/includes/bootstrap.php:56)
372
373/src/wp-includes/class-wp.php:497
374/src/wp-includes/class-wp.php:725
375/tests/phpunit/includes/testcase.php:455
376/tests/phpunit/tests/oembed/template.php:107
377
37832) Tests_Embed_Template::test_oembed_output_scheduled_post
379ImagickException: Cannot modify header information - headers already sent by (output started at /tests/phpunit/includes/bootstrap.php:56)
380
381/src/wp-includes/class-wp.php:497
382/src/wp-includes/class-wp.php:725
383/tests/phpunit/includes/testcase.php:455
384/tests/phpunit/tests/oembed/template.php:129
385
38633) Tests_Embed_Template::test_oembed_output_private_post
387ImagickException: Cannot modify header information - headers already sent by (output started at /tests/phpunit/includes/bootstrap.php:56)
388
389/src/wp-includes/class-wp.php:497
390/src/wp-includes/class-wp.php:725
391/tests/phpunit/includes/testcase.php:455
392/tests/phpunit/tests/oembed/template.php:150
393
39434) Tests_Embed_Template::test_oembed_output_private_post_with_permissions
395ImagickException: Cannot modify header information - headers already sent by (output started at /tests/phpunit/includes/bootstrap.php:56)
396
397/src/wp-includes/class-wp.php:483
398/src/wp-includes/class-wp.php:725
399/tests/phpunit/includes/testcase.php:455
400/tests/phpunit/tests/oembed/template.php:175
401
40235) Tests_Embed_Template::test_wp_embed_excerpt_more
403ImagickException: Cannot modify header information - headers already sent by (output started at /tests/phpunit/includes/bootstrap.php:56)
404
405/src/wp-includes/class-wp.php:497
406/src/wp-includes/class-wp.php:725
407/tests/phpunit/includes/testcase.php:455
408/tests/phpunit/tests/oembed/template.php:203
409
41036) Tests_Embed_Template::test_is_embed_post
411ImagickException: Cannot modify header information - headers already sent by (output started at /tests/phpunit/includes/bootstrap.php:56)
412
413/src/wp-includes/class-wp.php:497
414/src/wp-includes/class-wp.php:725
415/tests/phpunit/includes/testcase.php:455
416/tests/phpunit/tests/oembed/template.php:219
417
41837) Tests_Embed_Template::test_is_embed_attachment
419ImagickException: Cannot modify header information - headers already sent by (output started at /tests/phpunit/includes/bootstrap.php:56)
420
421/src/wp-includes/class-wp.php:497
422/src/wp-includes/class-wp.php:725
423/tests/phpunit/includes/testcase.php:455
424/tests/phpunit/tests/oembed/template.php:229
425
42638) Tests_Embed_Template::test_is_embed_404
427ImagickException: Cannot modify header information - headers already sent by (output started at /tests/phpunit/includes/bootstrap.php:56)
428
429/src/wp-includes/class-wp.php:497
430/src/wp-includes/class-wp.php:725
431/tests/phpunit/includes/testcase.php:455
432/tests/phpunit/tests/oembed/template.php:234
433
43439) Tests_Post_GetBodyClass::test_with_utf8_category_slugs
435ImagickException: Cannot modify header information - headers already sent by (output started at /tests/phpunit/includes/bootstrap.php:56)
436
437/src/wp-includes/class-wp.php:497
438/src/wp-includes/class-wp.php:725
439/tests/phpunit/includes/testcase.php:455
440/tests/phpunit/tests/post/getBodyClass.php:24
441
44240) Tests_Post_GetBodyClass::test_with_utf8_tag_slugs
443ImagickException: Cannot modify header information - headers already sent by (output started at /tests/phpunit/includes/bootstrap.php:56)
444
445/src/wp-includes/class-wp.php:497
446/src/wp-includes/class-wp.php:725
447/tests/phpunit/includes/testcase.php:455
448/tests/phpunit/tests/post/getBodyClass.php:47
449
45041) Tests_Post_GetBodyClass::test_with_utf8_term_slugs
451ImagickException: Cannot modify header information - headers already sent by (output started at /tests/phpunit/includes/bootstrap.php:56)
452
453/src/wp-includes/class-wp.php:497
454/src/wp-includes/class-wp.php:725
455/tests/phpunit/includes/testcase.php:455
456/tests/phpunit/tests/post/getBodyClass.php:71
457
45842) Tests_Post_GetBodyClass::test_singular_body_classes
459ImagickException: Cannot modify header information - headers already sent by (output started at /tests/phpunit/includes/bootstrap.php:56)
460
461/src/wp-includes/class-wp.php:497
462/src/wp-includes/class-wp.php:725
463/tests/phpunit/includes/testcase.php:455
464/tests/phpunit/tests/post/getBodyClass.php:86
465
46643) Tests_Post_getPages::test_wp_list_pages_classes
467ImagickException: Cannot modify header information - headers already sent by (output started at /tests/phpunit/includes/bootstrap.php:56)
468
469/src/wp-includes/class-wp.php:497
470/src/wp-includes/class-wp.php:725
471/tests/phpunit/includes/testcase.php:455
472/tests/phpunit/tests/post/getPages.php:344
473
47444) Tests_Post_Output::test_the_content
475ImagickException: Cannot modify header information - headers already sent by (output started at /tests/phpunit/includes/bootstrap.php:56)
476
477/src/wp-includes/class-wp.php:497
478/src/wp-includes/class-wp.php:725
479/tests/phpunit/includes/testcase.php:455
480/tests/phpunit/tests/post/output.php:52
481
48245) Tests_Post_Output::test_the_content_shortcode
483ImagickException: Cannot modify header information - headers already sent by (output started at /tests/phpunit/includes/bootstrap.php:56)
484
485/src/wp-includes/class-wp.php:497
486/src/wp-includes/class-wp.php:725
487/tests/phpunit/includes/testcase.php:455
488/tests/phpunit/tests/post/output.php:80
489
49046) Tests_Post_Output::test_the_content_shortcode_paragraph
491ImagickException: Cannot modify header information - headers already sent by (output started at /tests/phpunit/includes/bootstrap.php:56)
492
493/src/wp-includes/class-wp.php:497
494/src/wp-includes/class-wp.php:725
495/tests/phpunit/includes/testcase.php:455
496/tests/phpunit/tests/post/output.php:118
497
49847) Tests_Post_Output::test_the_content_attribute_filtering
499ImagickException: Cannot modify header information - headers already sent by (output started at /tests/phpunit/includes/bootstrap.php:56)
500
501/src/wp-includes/class-wp.php:497
502/src/wp-includes/class-wp.php:725
503/tests/phpunit/includes/testcase.php:455
504/tests/phpunit/tests/post/output.php:140
505
50648) Tests_Post_Output::test_the_content_attribute_value_with_colon
507ImagickException: Cannot modify header information - headers already sent by (output started at /tests/phpunit/includes/bootstrap.php:56)
508
509/src/wp-includes/class-wp.php:497
510/src/wp-includes/class-wp.php:725
511/tests/phpunit/includes/testcase.php:455
512/tests/phpunit/tests/post/output.php:164
513
51449) Tests_Post_Template::test_wp_link_pages
515ImagickException: Cannot modify header information - headers already sent by (output started at /tests/phpunit/includes/bootstrap.php:56)
516
517/src/wp-includes/class-wp.php:497
518/src/wp-includes/class-wp.php:725
519/tests/phpunit/includes/testcase.php:455
520/tests/phpunit/tests/post/template.php:13
521
52250) Tests_Post_Template::test_get_page_template_slug_from_loop
523ImagickException: Cannot modify header information - headers already sent by (output started at /tests/phpunit/includes/bootstrap.php:56)
524
525/src/wp-includes/class-wp.php:497
526/src/wp-includes/class-wp.php:725
527/tests/phpunit/includes/testcase.php:455
528/tests/phpunit/tests/post/template.php:267
529
53051) Tests_Post_Template::test_get_page_template_slug_non_page
531ImagickException: Cannot modify header information - headers already sent by (output started at /tests/phpunit/includes/bootstrap.php:56)
532
533/src/wp-includes/class-wp.php:497
534/src/wp-includes/class-wp.php:725
535/tests/phpunit/includes/testcase.php:455
536/tests/phpunit/tests/post/template.php:282
537
53852) Tests_Query::test_pre_posts_per_page
539ImagickException: Cannot modify header information - headers already sent by (output started at /tests/phpunit/includes/bootstrap.php:56)
540
541/src/wp-includes/class-wp.php:497
542/src/wp-includes/class-wp.php:725
543/tests/phpunit/includes/testcase.php:455
544/tests/phpunit/tests/query.php:50
545
54653) Tests_Query::test_tag_queried_object
547ImagickException: Cannot modify header information - headers already sent by (output started at /tests/phpunit/includes/bootstrap.php:56)
548
549/src/wp-includes/class-wp.php:497
550/src/wp-includes/class-wp.php:725
551/tests/phpunit/includes/testcase.php:455
552/tests/phpunit/tests/query.php:69
553
55454) Tests_Query::test_cat_querystring_single_term
555ImagickException: Cannot modify header information - headers already sent by (output started at /tests/phpunit/includes/bootstrap.php:56)
556
557/src/wp-includes/class-wp.php:497
558/src/wp-includes/class-wp.php:725
559/tests/phpunit/includes/testcase.php:455
560/tests/phpunit/tests/query.php:154
561
56255) Tests_Query::test_category_querystring_multiple_terms_comma_separated
563ImagickException: Cannot modify header information - headers already sent by (output started at /tests/phpunit/includes/bootstrap.php:56)
564
565/src/wp-includes/class-wp.php:497
566/src/wp-includes/class-wp.php:725
567/tests/phpunit/includes/testcase.php:455
568/tests/phpunit/tests/query.php:189
569
57056) Tests_Query::test_category_querystring_multiple_terms_formatted_as_array
571ImagickException: Cannot modify header information - headers already sent by (output started at /tests/phpunit/includes/bootstrap.php:56)
572
573/src/wp-includes/class-wp.php:497
574/src/wp-includes/class-wp.php:725
575/tests/phpunit/includes/testcase.php:455
576/tests/phpunit/tests/query.php:227
577
57857) Tests_Query::test_tag_querystring_single_term
579ImagickException: Cannot modify header information - headers already sent by (output started at /tests/phpunit/includes/bootstrap.php:56)
580
581/src/wp-includes/class-wp.php:497
582/src/wp-includes/class-wp.php:725
583/tests/phpunit/includes/testcase.php:455
584/tests/phpunit/tests/query.php:257
585
58658) Tests_Query::test_tag_querystring_multiple_terms_comma_separated
587ImagickException: Cannot modify header information - headers already sent by (output started at /tests/phpunit/includes/bootstrap.php:56)
588
589/src/wp-includes/class-wp.php:497
590/src/wp-includes/class-wp.php:725
591/tests/phpunit/includes/testcase.php:455
592/tests/phpunit/tests/query.php:292
593
59459) Tests_Query::test_tag_querystring_multiple_terms_formatted_as_array
595ImagickException: Cannot modify header information - headers already sent by (output started at /tests/phpunit/includes/bootstrap.php:56)
596
597/src/wp-includes/class-wp.php:497
598/src/wp-includes/class-wp.php:725
599/tests/phpunit/includes/testcase.php:455
600/tests/phpunit/tests/query.php:330
601
60260) Tests_Query::test_custom_taxonomy_querystring_single_term
603ImagickException: Cannot modify header information - headers already sent by (output started at /tests/phpunit/includes/bootstrap.php:56)
604
605/src/wp-includes/class-wp.php:497
606/src/wp-includes/class-wp.php:725
607/tests/phpunit/includes/testcase.php:455
608/tests/phpunit/tests/query.php:356
609
61061) Tests_Query::test_custom_taxonomy_querystring_multiple_terms_comma_separated
611ImagickException: Cannot modify header information - headers already sent by (output started at /tests/phpunit/includes/bootstrap.php:56)
612
613/src/wp-includes/class-wp.php:497
614/src/wp-includes/class-wp.php:725
615/tests/phpunit/includes/testcase.php:455
616/tests/phpunit/tests/query.php:382
617
61862) Tests_Query::test_custom_taxonomy_querystring_multiple_terms_formatted_as_array
619ImagickException: Cannot modify header information - headers already sent by (output started at /tests/phpunit/includes/bootstrap.php:56)
620
621/src/wp-includes/class-wp.php:497
622/src/wp-includes/class-wp.php:725
623/tests/phpunit/includes/testcase.php:455
624/tests/phpunit/tests/query.php:411
625
62663) Tests_Query::test_pages_dont_404_when_queried_post_id_is_modified
627ImagickException: Cannot modify header information - headers already sent by (output started at /tests/phpunit/includes/bootstrap.php:56)
628
629/src/wp-includes/class-wp.php:497
630/src/wp-includes/class-wp.php:725
631/tests/phpunit/includes/testcase.php:455
632/tests/phpunit/tests/query.php:425
633
63464) Tests_Query::test_custom_hierarchical_post_types_404_when_queried_post_id_is_modified
635ImagickException: Cannot modify header information - headers already sent by (output started at /tests/phpunit/includes/bootstrap.php:56)
636
637/src/wp-includes/class-wp.php:497
638/src/wp-includes/class-wp.php:725
639/tests/phpunit/includes/testcase.php:455
640/tests/phpunit/tests/query.php:446
641
64265) Tests_Query::test_get_queried_object_should_return_first_of_multiple_terms
643ImagickException: Cannot modify header information - headers already sent by (output started at /tests/phpunit/includes/bootstrap.php:56)
644
645/src/wp-includes/class-wp.php:497
646/src/wp-includes/class-wp.php:725
647/tests/phpunit/includes/testcase.php:455
648/tests/phpunit/tests/query.php:539
649
65066) Tests_Query::test_query_vars_should_match_first_of_multiple_terms
651ImagickException: Cannot modify header information - headers already sent by (output started at /tests/phpunit/includes/bootstrap.php:56)
652
653/src/wp-includes/class-wp.php:497
654/src/wp-includes/class-wp.php:725
655/tests/phpunit/includes/testcase.php:455
656/tests/phpunit/tests/query.php:559
657
65867) Tests_Query_Conditionals::test_home
659ImagickException: Cannot modify header information - headers already sent by (output started at /tests/phpunit/includes/bootstrap.php:56)
660
661/src/wp-includes/class-wp.php:497
662/src/wp-includes/class-wp.php:725
663/tests/phpunit/includes/testcase.php:455
664/tests/phpunit/tests/query/conditionals.php:31
665
66668) Tests_Query_Conditionals::test_404
667ImagickException: Cannot modify header information - headers already sent by (output started at /tests/phpunit/includes/bootstrap.php:56)
668
669/src/wp-includes/class-wp.php:497
670/src/wp-includes/class-wp.php:725
671/tests/phpunit/includes/testcase.php:455
672/tests/phpunit/tests/query/conditionals.php:36
673
67469) Tests_Query_Conditionals::test_permalink
675ImagickException: Cannot modify header information - headers already sent by (output started at /tests/phpunit/includes/bootstrap.php:56)
676
677/src/wp-includes/class-wp.php:497
678/src/wp-includes/class-wp.php:725
679/tests/phpunit/includes/testcase.php:455
680/tests/phpunit/tests/query/conditionals.php:42
681
68270) Tests_Query_Conditionals::test_post_comments_feed
683ImagickException: Cannot modify header information - headers already sent by (output started at /tests/phpunit/includes/bootstrap.php:56)
684
685/src/wp-includes/class-wp.php:497
686/src/wp-includes/class-wp.php:725
687/tests/phpunit/includes/testcase.php:455
688/tests/phpunit/tests/query/conditionals.php:49
689
69071) Tests_Query_Conditionals::test_post_comments_feed_with_no_comments
691ImagickException: Cannot modify header information - headers already sent by (output started at /tests/phpunit/includes/bootstrap.php:56)
692
693/src/wp-includes/class-wp.php:497
694/src/wp-includes/class-wp.php:725
695/tests/phpunit/includes/testcase.php:455
696/tests/phpunit/tests/query/conditionals.php:56
697
69872) Tests_Query_Conditionals::test_attachment_comments_feed
699ImagickException: Cannot modify header information - headers already sent by (output started at /tests/phpunit/includes/bootstrap.php:56)
700
701/src/wp-includes/class-wp.php:497
702/src/wp-includes/class-wp.php:725
703/tests/phpunit/includes/testcase.php:455
704/tests/phpunit/tests/query/conditionals.php:63
705
70673) Tests_Query_Conditionals::test_page
707ImagickException: Cannot modify header information - headers already sent by (output started at /tests/phpunit/includes/bootstrap.php:56)
708
709/src/wp-includes/class-wp.php:497
710/src/wp-includes/class-wp.php:725
711/tests/phpunit/includes/testcase.php:455
712/tests/phpunit/tests/query/conditionals.php:69
713
71474) Tests_Query_Conditionals::test_parent_page
715ImagickException: Cannot modify header information - headers already sent by (output started at /tests/phpunit/includes/bootstrap.php:56)
716
717/src/wp-includes/class-wp.php:497
718/src/wp-includes/class-wp.php:725
719/tests/phpunit/includes/testcase.php:455
720/tests/phpunit/tests/query/conditionals.php:75
721
72275) Tests_Query_Conditionals::test_child_page_1
723ImagickException: Cannot modify header information - headers already sent by (output started at /tests/phpunit/includes/bootstrap.php:56)
724
725/src/wp-includes/class-wp.php:497
726/src/wp-includes/class-wp.php:725
727/tests/phpunit/includes/testcase.php:455
728/tests/phpunit/tests/query/conditionals.php:83
729
73076) Tests_Query_Conditionals::test_child_page_2
731ImagickException: Cannot modify header information - headers already sent by (output started at /tests/phpunit/includes/bootstrap.php:56)
732
733/src/wp-includes/class-wp.php:497
734/src/wp-includes/class-wp.php:725
735/tests/phpunit/includes/testcase.php:455
736/tests/phpunit/tests/query/conditionals.php:92
737
73877) Tests_Query_Conditionals::test_page_trackback
739ImagickException: Cannot modify header information - headers already sent by (output started at /tests/phpunit/includes/bootstrap.php:56)
740
741/src/wp-includes/class-wp.php:497
742/src/wp-includes/class-wp.php:725
743/tests/phpunit/includes/testcase.php:455
744/tests/phpunit/tests/query/conditionals.php:105
745
74678) Tests_Query_Conditionals::test_page_feed
747ImagickException: Cannot modify header information - headers already sent by (output started at /tests/phpunit/includes/bootstrap.php:56)
748
749/src/wp-includes/class-wp.php:497
750/src/wp-includes/class-wp.php:725
751/tests/phpunit/includes/testcase.php:455
752/tests/phpunit/tests/query/conditionals.php:125
753
75479) Tests_Query_Conditionals::test_page_feed_with_no_comments
755ImagickException: Cannot modify header information - headers already sent by (output started at /tests/phpunit/includes/bootstrap.php:56)
756
757/src/wp-includes/class-wp.php:497
758/src/wp-includes/class-wp.php:725
759/tests/phpunit/includes/testcase.php:455
760/tests/phpunit/tests/query/conditionals.php:143
761
76280) Tests_Query_Conditionals::test_page_feed_atom
763ImagickException: Cannot modify header information - headers already sent by (output started at /tests/phpunit/includes/bootstrap.php:56)
764
765/src/wp-includes/class-wp.php:497
766/src/wp-includes/class-wp.php:725
767/tests/phpunit/includes/testcase.php:455
768/tests/phpunit/tests/query/conditionals.php:164
769
77081) Tests_Query_Conditionals::test_page_page_2
771ImagickException: Cannot modify header information - headers already sent by (output started at /tests/phpunit/includes/bootstrap.php:56)
772
773/src/wp-includes/class-wp.php:497
774/src/wp-includes/class-wp.php:725
775/tests/phpunit/includes/testcase.php:455
776/tests/phpunit/tests/query/conditionals.php:178
777
77882) Tests_Query_Conditionals::test_page_page_2_no_slash
779ImagickException: Cannot modify header information - headers already sent by (output started at /tests/phpunit/includes/bootstrap.php:56)
780
781/src/wp-includes/class-wp.php:497
782/src/wp-includes/class-wp.php:725
783/tests/phpunit/includes/testcase.php:455
784/tests/phpunit/tests/query/conditionals.php:191
785
78683) Tests_Query_Conditionals::test_pagination_of_posts_page
787ImagickException: Cannot modify header information - headers already sent by (output started at /tests/phpunit/includes/bootstrap.php:56)
788
789/src/wp-includes/class-wp.php:497
790/src/wp-includes/class-wp.php:725
791/tests/phpunit/includes/testcase.php:455
792/tests/phpunit/tests/query/conditionals.php:208
793
79484) Tests_Query_Conditionals::test_main_feed_2
795ImagickException: Cannot modify header information - headers already sent by (output started at /tests/phpunit/includes/bootstrap.php:56)
796
797/src/wp-includes/class-wp.php:497
798/src/wp-includes/class-wp.php:725
799/tests/phpunit/includes/testcase.php:455
800/tests/phpunit/tests/query/conditionals.php:231
801
80285) Tests_Query_Conditionals::test_main_feed
803ImagickException: Cannot modify header information - headers already sent by (output started at /tests/phpunit/includes/bootstrap.php:56)
804
805/src/wp-includes/class-wp.php:497
806/src/wp-includes/class-wp.php:725
807/tests/phpunit/includes/testcase.php:455
808/tests/phpunit/tests/query/conditionals.php:247
809
81086) Tests_Query_Conditionals::test_paged
811ImagickException: Cannot modify header information - headers already sent by (output started at /tests/phpunit/includes/bootstrap.php:56)
812
813/src/wp-includes/class-wp.php:497
814/src/wp-includes/class-wp.php:725
815/tests/phpunit/includes/testcase.php:455
816/tests/phpunit/tests/query/conditionals.php:257
817
81887) Tests_Query_Conditionals::test_main_comments_feed
819ImagickException: Cannot modify header information - headers already sent by (output started at /tests/phpunit/includes/bootstrap.php:56)
820
821/src/wp-includes/class-wp.php:497
822/src/wp-includes/class-wp.php:725
823/tests/phpunit/includes/testcase.php:455
824/tests/phpunit/tests/query/conditionals.php:269
825
82688) Tests_Query_Conditionals::test_search_feed
827ImagickException: Cannot modify header information - headers already sent by (output started at /tests/phpunit/includes/bootstrap.php:56)
828
829/src/wp-includes/class-wp.php:497
830/src/wp-includes/class-wp.php:725
831/tests/phpunit/includes/testcase.php:455
832/tests/phpunit/tests/query/conditionals.php:294
833
83489) Tests_Query_Conditionals::test_search_paged
835ImagickException: Cannot modify header information - headers already sent by (output started at /tests/phpunit/includes/bootstrap.php:56)
836
837/src/wp-includes/class-wp.php:497
838/src/wp-includes/class-wp.php:725
839/tests/phpunit/includes/testcase.php:455
840/tests/phpunit/tests/query/conditionals.php:310
841
84290) Tests_Query_Conditionals::test_search
843ImagickException: Cannot modify header information - headers already sent by (output started at /tests/phpunit/includes/bootstrap.php:56)
844
845/src/wp-includes/class-wp.php:497
846/src/wp-includes/class-wp.php:725
847/tests/phpunit/includes/testcase.php:455
848/tests/phpunit/tests/query/conditionals.php:316
849
85091) Tests_Query_Conditionals::test_search_encoded_chars
851ImagickException: Cannot modify header information - headers already sent by (output started at /tests/phpunit/includes/bootstrap.php:56)
852
853/src/wp-includes/class-wp.php:497
854/src/wp-includes/class-wp.php:725
855/tests/phpunit/includes/testcase.php:455
856/tests/phpunit/tests/query/conditionals.php:324
857
85892) Tests_Query_Conditionals::test_category_feed
859ImagickException: Cannot modify header information - headers already sent by (output started at /tests/phpunit/includes/bootstrap.php:56)
860
861/src/wp-includes/class-wp.php:497
862/src/wp-includes/class-wp.php:725
863/tests/phpunit/includes/testcase.php:455
864/tests/phpunit/tests/query/conditionals.php:335
865
86693) Tests_Query_Conditionals::test_category_paged
867ImagickException: Cannot modify header information - headers already sent by (output started at /tests/phpunit/includes/bootstrap.php:56)
868
869/src/wp-includes/class-wp.php:497
870/src/wp-includes/class-wp.php:725
871/tests/phpunit/includes/testcase.php:455
872/tests/phpunit/tests/query/conditionals.php:351
873
87494) Tests_Query_Conditionals::test_category
875ImagickException: Cannot modify header information - headers already sent by (output started at /tests/phpunit/includes/bootstrap.php:56)
876
877/src/wp-includes/class-wp.php:497
878/src/wp-includes/class-wp.php:725
879/tests/phpunit/includes/testcase.php:455
880/tests/phpunit/tests/query/conditionals.php:358
881
88295) Tests_Query_Conditionals::test_tag_feed
883ImagickException: Cannot modify header information - headers already sent by (output started at /tests/phpunit/includes/bootstrap.php:56)
884
885/src/wp-includes/class-wp.php:497
886/src/wp-includes/class-wp.php:725
887/tests/phpunit/includes/testcase.php:455
888/tests/phpunit/tests/query/conditionals.php:369
889
89096) Tests_Query_Conditionals::test_tag_paged
891ImagickException: Cannot modify header information - headers already sent by (output started at /tests/phpunit/includes/bootstrap.php:56)
892
893/src/wp-includes/class-wp.php:497
894/src/wp-includes/class-wp.php:725
895/tests/phpunit/includes/testcase.php:455
896/tests/phpunit/tests/query/conditionals.php:387
897
89897) Tests_Query_Conditionals::test_tag
899ImagickException: Cannot modify header information - headers already sent by (output started at /tests/phpunit/includes/bootstrap.php:56)
900
901/src/wp-includes/class-wp.php:497
902/src/wp-includes/class-wp.php:725
903/tests/phpunit/includes/testcase.php:455
904/tests/phpunit/tests/query/conditionals.php:394
905
90698) Tests_Query_Conditionals::test_author_feed
907ImagickException: Cannot modify header information - headers already sent by (output started at /tests/phpunit/includes/bootstrap.php:56)
908
909/src/wp-includes/class-wp.php:497
910/src/wp-includes/class-wp.php:725
911/tests/phpunit/includes/testcase.php:455
912/tests/phpunit/tests/query/conditionals.php:416
913
91499) Tests_Query_Conditionals::test_author_paged
915ImagickException: Cannot modify header information - headers already sent by (output started at /tests/phpunit/includes/bootstrap.php:56)
916
917/src/wp-includes/class-wp.php:497
918/src/wp-includes/class-wp.php:725
919/tests/phpunit/includes/testcase.php:455
920/tests/phpunit/tests/query/conditionals.php:433
921
922100) Tests_Query_Conditionals::test_author
923ImagickException: Cannot modify header information - headers already sent by (output started at /tests/phpunit/includes/bootstrap.php:56)
924
925/src/wp-includes/class-wp.php:497
926/src/wp-includes/class-wp.php:725
927/tests/phpunit/includes/testcase.php:455
928/tests/phpunit/tests/query/conditionals.php:441
929
930101) Tests_Query_Conditionals::test_author_with_no_posts
931ImagickException: Cannot modify header information - headers already sent by (output started at /tests/phpunit/includes/bootstrap.php:56)
932
933/src/wp-includes/class-wp.php:497
934/src/wp-includes/class-wp.php:725
935/tests/phpunit/includes/testcase.php:455
936/tests/phpunit/tests/query/conditionals.php:447
937
938102) Tests_Query_Conditionals::test_ymd_feed
939ImagickException: Cannot modify header information - headers already sent by (output started at /tests/phpunit/includes/bootstrap.php:56)
940
941/src/wp-includes/class-wp.php:497
942/src/wp-includes/class-wp.php:725
943/tests/phpunit/includes/testcase.php:455
944/tests/phpunit/tests/query/conditionals.php:458
945
946103) Tests_Query_Conditionals::test_ymd_paged
947ImagickException: Cannot modify header information - headers already sent by (output started at /tests/phpunit/includes/bootstrap.php:56)
948
949/src/wp-includes/class-wp.php:497
950/src/wp-includes/class-wp.php:725
951/tests/phpunit/includes/testcase.php:455
952/tests/phpunit/tests/query/conditionals.php:474
953
954104) Tests_Query_Conditionals::test_ymd
955ImagickException: Cannot modify header information - headers already sent by (output started at /tests/phpunit/includes/bootstrap.php:56)
956
957/src/wp-includes/class-wp.php:497
958/src/wp-includes/class-wp.php:725
959/tests/phpunit/includes/testcase.php:455
960/tests/phpunit/tests/query/conditionals.php:481
961
962105) Tests_Query_Conditionals::test_ym_feed
963ImagickException: Cannot modify header information - headers already sent by (output started at /tests/phpunit/includes/bootstrap.php:56)
964
965/src/wp-includes/class-wp.php:497
966/src/wp-includes/class-wp.php:725
967/tests/phpunit/includes/testcase.php:455
968/tests/phpunit/tests/query/conditionals.php:492
969
970106) Tests_Query_Conditionals::test_ym_paged
971ImagickException: Cannot modify header information - headers already sent by (output started at /tests/phpunit/includes/bootstrap.php:56)
972
973/src/wp-includes/class-wp.php:497
974/src/wp-includes/class-wp.php:725
975/tests/phpunit/includes/testcase.php:455
976/tests/phpunit/tests/query/conditionals.php:508
977
978107) Tests_Query_Conditionals::test_ym
979ImagickException: Cannot modify header information - headers already sent by (output started at /tests/phpunit/includes/bootstrap.php:56)
980
981/src/wp-includes/class-wp.php:497
982/src/wp-includes/class-wp.php:725
983/tests/phpunit/includes/testcase.php:455
984/tests/phpunit/tests/query/conditionals.php:515
985
986108) Tests_Query_Conditionals::test_y_feed
987ImagickException: Cannot modify header information - headers already sent by (output started at /tests/phpunit/includes/bootstrap.php:56)
988
989/src/wp-includes/class-wp.php:497
990/src/wp-includes/class-wp.php:725
991/tests/phpunit/includes/testcase.php:455
992/tests/phpunit/tests/query/conditionals.php:526
993
994109) Tests_Query_Conditionals::test_y_paged
995ImagickException: Cannot modify header information - headers already sent by (output started at /tests/phpunit/includes/bootstrap.php:56)
996
997/src/wp-includes/class-wp.php:497
998/src/wp-includes/class-wp.php:725
999/tests/phpunit/includes/testcase.php:455
1000/tests/phpunit/tests/query/conditionals.php:542
1001
1002110) Tests_Query_Conditionals::test_y
1003ImagickException: Cannot modify header information - headers already sent by (output started at /tests/phpunit/includes/bootstrap.php:56)
1004
1005/src/wp-includes/class-wp.php:497
1006/src/wp-includes/class-wp.php:725
1007/tests/phpunit/includes/testcase.php:455
1008/tests/phpunit/tests/query/conditionals.php:549
1009
1010111) Tests_Query_Conditionals::test_post_trackback
1011ImagickException: Cannot modify header information - headers already sent by (output started at /tests/phpunit/includes/bootstrap.php:56)
1012
1013/src/wp-includes/class-wp.php:497
1014/src/wp-includes/class-wp.php:725
1015/tests/phpunit/includes/testcase.php:455
1016/tests/phpunit/tests/query/conditionals.php:557
1017
1018112) Tests_Query_Conditionals::test_post_comment_feed
1019ImagickException: Cannot modify header information - headers already sent by (output started at /tests/phpunit/includes/bootstrap.php:56)
1020
1021/src/wp-includes/class-wp.php:497
1022/src/wp-includes/class-wp.php:725
1023/tests/phpunit/includes/testcase.php:455
1024/tests/phpunit/tests/query/conditionals.php:569
1025
1026113) Tests_Query_Conditionals::test_post_paged_short
1027ImagickException: Cannot modify header information - headers already sent by (output started at /tests/phpunit/includes/bootstrap.php:56)
1028
1029/src/wp-includes/class-wp.php:497
1030/src/wp-includes/class-wp.php:725
1031/tests/phpunit/includes/testcase.php:455
1032/tests/phpunit/tests/query/conditionals.php:588
1033
1034114) Tests_Query_Conditionals::test_post_attachment
1035ImagickException: Cannot modify header information - headers already sent by (output started at /tests/phpunit/includes/bootstrap.php:56)
1036
1037/src/wp-includes/class-wp.php:497
1038/src/wp-includes/class-wp.php:725
1039/tests/phpunit/includes/testcase.php:455
1040/tests/phpunit/tests/query/conditionals.php:598
1041
1042115) Tests_Query_Conditionals::test_bad_dates
1043ImagickException: Cannot modify header information - headers already sent by (output started at /tests/phpunit/includes/bootstrap.php:56)
1044
1045/src/wp-includes/class-wp.php:497
1046/src/wp-includes/class-wp.php:725
1047/tests/phpunit/includes/testcase.php:455
1048/tests/phpunit/tests/query/conditionals.php:614
1049
1050116) Tests_Query_Conditionals::test_post_type_archive_with_tax_query
1051ImagickException: Cannot modify header information - headers already sent by (output started at /tests/phpunit/includes/bootstrap.php:56)
1052
1053/src/wp-includes/class-wp.php:497
1054/src/wp-includes/class-wp.php:725
1055/tests/phpunit/includes/testcase.php:455
1056/tests/phpunit/tests/query/conditionals.php:636
1057
1058117) Tests_Query_Conditionals::test_post_type_array
1059ImagickException: Cannot modify header information - headers already sent by (output started at /tests/phpunit/includes/bootstrap.php:56)
1060
1061/src/wp-includes/class-wp.php:497
1062/src/wp-includes/class-wp.php:725
1063/tests/phpunit/includes/testcase.php:455
1064/tests/phpunit/tests/query/conditionals.php:668
1065
1066118) Tests_Query_Conditionals::test_is_single
1067ImagickException: Cannot modify header information - headers already sent by (output started at /tests/phpunit/includes/bootstrap.php:56)
1068
1069/src/wp-includes/class-wp.php:497
1070/src/wp-includes/class-wp.php:725
1071/tests/phpunit/includes/testcase.php:455
1072/tests/phpunit/tests/query/conditionals.php:687
1073
1074119) Tests_Query_Conditionals::test_is_single_with_parent
1075ImagickException: Cannot modify header information - headers already sent by (output started at /tests/phpunit/includes/bootstrap.php:56)
1076
1077/src/wp-includes/class-wp.php:497
1078/src/wp-includes/class-wp.php:725
1079/tests/phpunit/includes/testcase.php:455
1080/tests/phpunit/tests/query/conditionals.php:729
1081
1082120) Tests_Query_Conditionals::test_is_single_with_slug_that_begins_with_a_number_that_clashes_with_another_post_id
1083ImagickException: Cannot modify header information - headers already sent by (output started at /tests/phpunit/includes/bootstrap.php:56)
1084
1085/src/wp-includes/class-wp.php:497
1086/src/wp-includes/class-wp.php:725
1087/tests/phpunit/includes/testcase.php:455
1088/tests/phpunit/tests/query/conditionals.php:760
1089
1090121) Tests_Query_Conditionals::test_is_single_with_slug_that_clashes_with_attachment
1091ImagickException: Cannot modify header information - headers already sent by (output started at /tests/phpunit/includes/bootstrap.php:56)
1092
1093/src/wp-includes/class-wp.php:497
1094/src/wp-includes/class-wp.php:725
1095/tests/phpunit/includes/testcase.php:455
1096/tests/phpunit/tests/query/conditionals.php:784
1097
1098122) Tests_Query_Conditionals::test_is_page
1099ImagickException: Cannot modify header information - headers already sent by (output started at /tests/phpunit/includes/bootstrap.php:56)
1100
1101/src/wp-includes/class-wp.php:497
1102/src/wp-includes/class-wp.php:725
1103/tests/phpunit/includes/testcase.php:455
1104/tests/phpunit/tests/query/conditionals.php:798
1105
1106123) Tests_Query_Conditionals::test_is_page_with_parent
1107ImagickException: Cannot modify header information - headers already sent by (output started at /tests/phpunit/includes/bootstrap.php:56)
1108
1109/src/wp-includes/class-wp.php:497
1110/src/wp-includes/class-wp.php:725
1111/tests/phpunit/includes/testcase.php:455
1112/tests/phpunit/tests/query/conditionals.php:826
1113
1114124) Tests_Query_Conditionals::test_is_attachment
1115ImagickException: Cannot modify header information - headers already sent by (output started at /tests/phpunit/includes/bootstrap.php:56)
1116
1117/src/wp-includes/class-wp.php:497
1118/src/wp-includes/class-wp.php:725
1119/tests/phpunit/includes/testcase.php:455
1120/tests/phpunit/tests/query/conditionals.php:848
1121
1122125) Tests_Query_Conditionals::test_is_attachment_with_slug_that_begins_with_a_number_that_clashes_with_a_page_ID
1123ImagickException: Cannot modify header information - headers already sent by (output started at /tests/phpunit/includes/bootstrap.php:56)
1124
1125/src/wp-includes/class-wp.php:497
1126/src/wp-includes/class-wp.php:725
1127/tests/phpunit/includes/testcase.php:455
1128/tests/phpunit/tests/query/conditionals.php:876
1129
1130126) Tests_Query_Conditionals::test_is_author_with_nicename_that_begins_with_a_number_that_clashes_with_another_author_id
1131ImagickException: Cannot modify header information - headers already sent by (output started at /tests/phpunit/includes/bootstrap.php:56)
1132
1133/src/wp-includes/class-wp.php:497
1134/src/wp-includes/class-wp.php:725
1135/tests/phpunit/includes/testcase.php:455
1136/tests/phpunit/tests/query/conditionals.php:897
1137
1138127) Tests_Query_Conditionals::test_is_category_with_slug_that_begins_with_a_number_that_clashes_with_another_category_id
1139ImagickException: Cannot modify header information - headers already sent by (output started at /tests/phpunit/includes/bootstrap.php:56)
1140
1141/src/wp-includes/class-wp.php:497
1142/src/wp-includes/class-wp.php:725
1143/tests/phpunit/includes/testcase.php:455
1144/tests/phpunit/tests/query/conditionals.php:918
1145
1146128) Tests_Query_Conditionals::test_is_tag_with_slug_that_begins_with_a_number_that_clashes_with_another_tag_id
1147ImagickException: Cannot modify header information - headers already sent by (output started at /tests/phpunit/includes/bootstrap.php:56)
1148
1149/src/wp-includes/class-wp.php:497
1150/src/wp-includes/class-wp.php:725
1151/tests/phpunit/includes/testcase.php:455
1152/tests/phpunit/tests/query/conditionals.php:939
1153
1154129) Tests_Query_Conditionals::test_is_page_with_page_id_zero_and_random_page_slug
1155ImagickException: Cannot modify header information - headers already sent by (output started at /tests/phpunit/includes/bootstrap.php:56)
1156
1157/src/wp-includes/class-wp.php:497
1158/src/wp-includes/class-wp.php:725
1159/tests/phpunit/includes/testcase.php:455
1160/tests/phpunit/tests/query/conditionals.php:954
1161
1162130) Tests_Query_Conditionals::test_is_page_with_page_slug_that_begins_with_a_number_that_clashes_with_a_page_ID
1163ImagickException: Cannot modify header information - headers already sent by (output started at /tests/phpunit/includes/bootstrap.php:56)
1164
1165/src/wp-includes/class-wp.php:497
1166/src/wp-includes/class-wp.php:725
1167/tests/phpunit/includes/testcase.php:455
1168/tests/phpunit/tests/query/conditionals.php:983
1169
1170131) Tests_Query_Conditionals::test_is_page_template
1171ImagickException: Cannot modify header information - headers already sent by (output started at /tests/phpunit/includes/bootstrap.php:56)
1172
1173/src/wp-includes/class-wp.php:497
1174/src/wp-includes/class-wp.php:725
1175/tests/phpunit/includes/testcase.php:455
1176/tests/phpunit/tests/query/conditionals.php:996
1177
1178132) Tests_Query_Conditionals::test_is_page_template_default
1179ImagickException: Cannot modify header information - headers already sent by (output started at /tests/phpunit/includes/bootstrap.php:56)
1180
1181/src/wp-includes/class-wp.php:497
1182/src/wp-includes/class-wp.php:725
1183/tests/phpunit/includes/testcase.php:455
1184/tests/phpunit/tests/query/conditionals.php:1005
1185
1186133) Tests_Query_Conditionals::test_is_page_template_array
1187ImagickException: Cannot modify header information - headers already sent by (output started at /tests/phpunit/includes/bootstrap.php:56)
1188
1189/src/wp-includes/class-wp.php:497
1190/src/wp-includes/class-wp.php:725
1191/tests/phpunit/includes/testcase.php:455
1192/tests/phpunit/tests/query/conditionals.php:1016
1193
1194134) Tests_Query_Conditionals::test_is_attachment_should_not_match_numeric_id_to_post_title_beginning_with_id
1195ImagickException: Cannot modify header information - headers already sent by (output started at /tests/phpunit/includes/bootstrap.php:56)
1196
1197/src/wp-includes/class-wp.php:497
1198/src/wp-includes/class-wp.php:725
1199/tests/phpunit/includes/testcase.php:455
1200/tests/phpunit/tests/query/conditionals.php:1036
1201
1202135) Tests_Query_Conditionals::test_is_attachment_should_not_match_numeric_id_to_post_name_beginning_with_id
1203ImagickException: Cannot modify header information - headers already sent by (output started at /tests/phpunit/includes/bootstrap.php:56)
1204
1205/src/wp-includes/class-wp.php:497
1206/src/wp-includes/class-wp.php:725
1207/tests/phpunit/includes/testcase.php:455
1208/tests/phpunit/tests/query/conditionals.php:1057
1209
1210136) Tests_Query_Conditionals::test_is_author_should_not_match_numeric_id_to_nickname_beginning_with_id
1211ImagickException: Cannot modify header information - headers already sent by (output started at /tests/phpunit/includes/bootstrap.php:56)
1212
1213/src/wp-includes/class-wp.php:497
1214/src/wp-includes/class-wp.php:725
1215/tests/phpunit/includes/testcase.php:455
1216/tests/phpunit/tests/query/conditionals.php:1076
1217
1218137) Tests_Query_Conditionals::test_is_author_should_not_match_numeric_id_to_user_nicename_beginning_with_id
1219ImagickException: Cannot modify header information - headers already sent by (output started at /tests/phpunit/includes/bootstrap.php:56)
1220
1221/src/wp-includes/class-wp.php:497
1222/src/wp-includes/class-wp.php:725
1223/tests/phpunit/includes/testcase.php:455
1224/tests/phpunit/tests/query/conditionals.php:1095
1225
1226138) Tests_Query_Conditionals::test_is_category_should_not_match_numeric_id_to_name_beginning_with_id
1227ImagickException: Cannot modify header information - headers already sent by (output started at /tests/phpunit/includes/bootstrap.php:56)
1228
1229/src/wp-includes/class-wp.php:497
1230/src/wp-includes/class-wp.php:725
1231/tests/phpunit/includes/testcase.php:455
1232/tests/phpunit/tests/query/conditionals.php:1116
1233
1234139) Tests_Query_Conditionals::test_is_category_should_not_match_numeric_id_to_slug_beginning_with_id
1235ImagickException: Cannot modify header information - headers already sent by (output started at /tests/phpunit/includes/bootstrap.php:56)
1236
1237/src/wp-includes/class-wp.php:497
1238/src/wp-includes/class-wp.php:725
1239/tests/phpunit/includes/testcase.php:455
1240/tests/phpunit/tests/query/conditionals.php:1137
1241
1242140) Tests_Query_Conditionals::test_is_tag_should_not_match_numeric_id_to_name_beginning_with_id
1243ImagickException: Cannot modify header information - headers already sent by (output started at /tests/phpunit/includes/bootstrap.php:56)
1244
1245/src/wp-includes/class-wp.php:497
1246/src/wp-includes/class-wp.php:725
1247/tests/phpunit/includes/testcase.php:455
1248/tests/phpunit/tests/query/conditionals.php:1158
1249
1250141) Tests_Query_Conditionals::test_is_tag_should_not_match_numeric_id_to_slug_beginning_with_id
1251ImagickException: Cannot modify header information - headers already sent by (output started at /tests/phpunit/includes/bootstrap.php:56)
1252
1253/src/wp-includes/class-wp.php:497
1254/src/wp-includes/class-wp.php:725
1255/tests/phpunit/includes/testcase.php:455
1256/tests/phpunit/tests/query/conditionals.php:1179
1257
1258142) Tests_Query_Conditionals::test_is_page_should_not_match_numeric_id_to_post_title_beginning_with_id
1259ImagickException: Cannot modify header information - headers already sent by (output started at /tests/phpunit/includes/bootstrap.php:56)
1260
1261/src/wp-includes/class-wp.php:497
1262/src/wp-includes/class-wp.php:725
1263/tests/phpunit/includes/testcase.php:455
1264/tests/phpunit/tests/query/conditionals.php:1200
1265
1266143) Tests_Query_Conditionals::test_is_page_should_not_match_numeric_id_to_post_name_beginning_with_id
1267ImagickException: Cannot modify header information - headers already sent by (output started at /tests/phpunit/includes/bootstrap.php:56)
1268
1269/src/wp-includes/class-wp.php:497
1270/src/wp-includes/class-wp.php:725
1271/tests/phpunit/includes/testcase.php:455
1272/tests/phpunit/tests/query/conditionals.php:1221
1273
1274144) Tests_Query_Conditionals::test_is_single_should_not_match_numeric_id_to_post_title_beginning_with_id
1275ImagickException: Cannot modify header information - headers already sent by (output started at /tests/phpunit/includes/bootstrap.php:56)
1276
1277/src/wp-includes/class-wp.php:497
1278/src/wp-includes/class-wp.php:725
1279/tests/phpunit/includes/testcase.php:455
1280/tests/phpunit/tests/query/conditionals.php:1242
1281
1282145) Tests_Query_Conditionals::test_is_single_should_not_match_numeric_id_to_post_name_beginning_with_id
1283ImagickException: Cannot modify header information - headers already sent by (output started at /tests/phpunit/includes/bootstrap.php:56)
1284
1285/src/wp-includes/class-wp.php:497
1286/src/wp-includes/class-wp.php:725
1287/tests/phpunit/includes/testcase.php:455
1288/tests/phpunit/tests/query/conditionals.php:1263
1289
1290146) Tests_Query_IsTerm::test_tag_action_tax
1291ImagickException: Cannot modify header information - headers already sent by (output started at /tests/phpunit/includes/bootstrap.php:56)
1292
1293/src/wp-includes/class-wp.php:497
1294/src/wp-includes/class-wp.php:725
1295/tests/phpunit/includes/testcase.php:455
1296/tests/phpunit/tests/query/isTerm.php:71
1297
1298147) Tests_Query_IsTerm::test_tag_query_cat_action_tax
1299ImagickException: Cannot modify header information - headers already sent by (output started at /tests/phpunit/includes/bootstrap.php:56)
1300
1301/src/wp-includes/class-wp.php:497
1302/src/wp-includes/class-wp.php:725
1303/tests/phpunit/includes/testcase.php:455
1304/tests/phpunit/tests/query/isTerm.php:82
1305
1306148) Tests_Query_IsTerm::test_tag_query_cat_query_tax_action_tax
1307ImagickException: Cannot modify header information - headers already sent by (output started at /tests/phpunit/includes/bootstrap.php:56)
1308
1309/src/wp-includes/class-wp.php:497
1310/src/wp-includes/class-wp.php:725
1311/tests/phpunit/includes/testcase.php:455
1312/tests/phpunit/tests/query/isTerm.php:94
1313
1314149) Tests_Query_IsTerm::test_cat_action_tax
1315ImagickException: Cannot modify header information - headers already sent by (output started at /tests/phpunit/includes/bootstrap.php:56)
1316
1317/src/wp-includes/class-wp.php:497
1318/src/wp-includes/class-wp.php:725
1319/tests/phpunit/includes/testcase.php:455
1320/tests/phpunit/tests/query/isTerm.php:107
1321
1322150) Tests_Query_IsTerm::test_cat_uncat_action_tax
1323ImagickException: Cannot modify header information - headers already sent by (output started at /tests/phpunit/includes/bootstrap.php:56)
1324
1325/src/wp-includes/class-wp.php:497
1326/src/wp-includes/class-wp.php:725
1327/tests/phpunit/includes/testcase.php:455
1328/tests/phpunit/tests/query/isTerm.php:123
1329
1330151) Tests_Query_IsTerm::test_tax_action_tax
1331ImagickException: Cannot modify header information - headers already sent by (output started at /tests/phpunit/includes/bootstrap.php:56)
1332
1333/src/wp-includes/class-wp.php:497
1334/src/wp-includes/class-wp.php:725
1335/tests/phpunit/includes/testcase.php:455
1336/tests/phpunit/tests/query/isTerm.php:147
1337
1338152) Tests_Query_IsTerm::test_tax_query_tag_action_tax
1339ImagickException: Cannot modify header information - headers already sent by (output started at /tests/phpunit/includes/bootstrap.php:56)
1340
1341/src/wp-includes/class-wp.php:497
1342/src/wp-includes/class-wp.php:725
1343/tests/phpunit/includes/testcase.php:455
1344/tests/phpunit/tests/query/isTerm.php:157
1345
1346153) Tests_Query_IsTerm::test_tax_query_cat_action_tax
1347ImagickException: Cannot modify header information - headers already sent by (output started at /tests/phpunit/includes/bootstrap.php:56)
1348
1349/src/wp-includes/class-wp.php:497
1350/src/wp-includes/class-wp.php:725
1351/tests/phpunit/includes/testcase.php:455
1352/tests/phpunit/tests/query/isTerm.php:168
1353
1354154) Tests_Query_SetupPostdata::test_secondary_query_post_vars
1355ImagickException: Cannot modify header information - headers already sent by (output started at /tests/phpunit/includes/bootstrap.php:56)
1356
1357/src/wp-includes/class-wp.php:497
1358/src/wp-includes/class-wp.php:725
1359/tests/phpunit/includes/testcase.php:455
1360/tests/phpunit/tests/query/setupPostdata.php:111
1361
1362155) Tests_Query_SetupPostdata::test_secondary_query_nextpage
1363ImagickException: Cannot modify header information - headers already sent by (output started at /tests/phpunit/includes/bootstrap.php:56)
1364
1365/src/wp-includes/class-wp.php:497
1366/src/wp-includes/class-wp.php:725
1367/tests/phpunit/includes/testcase.php:455
1368/tests/phpunit/tests/query/setupPostdata.php:200
1369
1370156) Tests_Query_SetupPostdata::test_page_from_wp_query
1371ImagickException: Cannot modify header information - headers already sent by (output started at /tests/phpunit/includes/bootstrap.php:56)
1372
1373/src/wp-includes/class-wp.php:497
1374/src/wp-includes/class-wp.php:725
1375/tests/phpunit/includes/testcase.php:455
1376/tests/phpunit/tests/query/setupPostdata.php:229
1377
1378157) Tests_Query_SetupPostdata::test_page_when_on_page
1379ImagickException: Cannot modify header information - headers already sent by (output started at /tests/phpunit/includes/bootstrap.php:56)
1380
1381/src/wp-includes/class-wp.php:497
1382/src/wp-includes/class-wp.php:725
1383/tests/phpunit/includes/testcase.php:455
1384/tests/phpunit/tests/query/setupPostdata.php:241
1385
1386158) Tests_Query_SetupPostdata::test_secondary_query_page
1387ImagickException: Cannot modify header information - headers already sent by (output started at /tests/phpunit/includes/bootstrap.php:56)
1388
1389/src/wp-includes/class-wp.php:497
1390/src/wp-includes/class-wp.php:725
1391/tests/phpunit/includes/testcase.php:455
1392/tests/phpunit/tests/query/setupPostdata.php:252
1393
1394159) Tests_Query_SetupPostdata::test_more_when_on_setup_post
1395ImagickException: Cannot modify header information - headers already sent by (output started at /tests/phpunit/includes/bootstrap.php:56)
1396
1397/src/wp-includes/class-wp.php:497
1398/src/wp-includes/class-wp.php:725
1399/tests/phpunit/includes/testcase.php:455
1400/tests/phpunit/tests/query/setupPostdata.php:283
1401
1402160) Tests_Query_SetupPostdata::test_more_when_on_single
1403ImagickException: Cannot modify header information - headers already sent by (output started at /tests/phpunit/includes/bootstrap.php:56)
1404
1405/src/wp-includes/class-wp.php:497
1406/src/wp-includes/class-wp.php:725
1407/tests/phpunit/includes/testcase.php:455
1408/tests/phpunit/tests/query/setupPostdata.php:297
1409
1410161) Tests_Query_SetupPostdata::test_more_when_on_page
1411ImagickException: Cannot modify header information - headers already sent by (output started at /tests/phpunit/includes/bootstrap.php:56)
1412
1413/src/wp-includes/class-wp.php:497
1414/src/wp-includes/class-wp.php:725
1415/tests/phpunit/includes/testcase.php:455
1416/tests/phpunit/tests/query/setupPostdata.php:313
1417
1418162) Tests_Query_SetupPostdata::test_more_when_on_feed
1419ImagickException: Cannot modify header information - headers already sent by (output started at /tests/phpunit/includes/bootstrap.php:56)
1420
1421/src/wp-includes/class-wp.php:497
1422/src/wp-includes/class-wp.php:725
1423/tests/phpunit/includes/testcase.php:455
1424/tests/phpunit/tests/query/setupPostdata.php:324
1425
1426163) Tests_Query_SetupPostdata::test_secondary_query_more
1427ImagickException: Cannot modify header information - headers already sent by (output started at /tests/phpunit/includes/bootstrap.php:56)
1428
1429/src/wp-includes/class-wp.php:497
1430/src/wp-includes/class-wp.php:725
1431/tests/phpunit/includes/testcase.php:455
1432/tests/phpunit/tests/query/setupPostdata.php:336
1433
1434164) Tests_Query_Stickies::test_stickies_should_be_included_when_is_home_is_true
1435ImagickException: Cannot modify header information - headers already sent by (output started at /tests/phpunit/includes/bootstrap.php:56)
1436
1437/src/wp-includes/class-wp.php:497
1438/src/wp-includes/class-wp.php:725
1439/tests/phpunit/includes/testcase.php:455
1440/tests/phpunit/tests/query/stickies.php:49
1441
1442165) Tests_Query_Stickies::test_stickies_should_not_be_included_on_pages_other_than_1
1443ImagickException: Cannot modify header information - headers already sent by (output started at /tests/phpunit/includes/bootstrap.php:56)
1444
1445/src/wp-includes/class-wp.php:497
1446/src/wp-includes/class-wp.php:725
1447/tests/phpunit/includes/testcase.php:455
1448/tests/phpunit/tests/query/stickies.php:59
1449
1450166) Tests_Query_Stickies::test_stickies_should_not_be_included_when_ignore_sticky_posts_is_true
1451ImagickException: Cannot modify header information - headers already sent by (output started at /tests/phpunit/includes/bootstrap.php:56)
1452
1453/src/wp-includes/class-wp.php:497
1454/src/wp-includes/class-wp.php:725
1455/tests/phpunit/includes/testcase.php:455
1456/tests/phpunit/tests/query/stickies.php:69
1457
1458167) Tests_Query_Stickies::test_stickies_should_obey_post__not_in
1459ImagickException: Cannot modify header information - headers already sent by (output started at /tests/phpunit/includes/bootstrap.php:56)
1460
1461/src/wp-includes/class-wp.php:497
1462/src/wp-includes/class-wp.php:725
1463/tests/phpunit/includes/testcase.php:455
1464/tests/phpunit/tests/query/stickies.php:92
1465
1466168) Tests_Query_VerbosePageRules::test_home
1467ImagickException: Cannot modify header information - headers already sent by (output started at /tests/phpunit/includes/bootstrap.php:56)
1468
1469/src/wp-includes/class-wp.php:497
1470/src/wp-includes/class-wp.php:725
1471/tests/phpunit/includes/testcase.php:455
1472/tests/phpunit/tests/query/conditionals.php:31
1473
1474169) Tests_Query_VerbosePageRules::test_404
1475ImagickException: Cannot modify header information - headers already sent by (output started at /tests/phpunit/includes/bootstrap.php:56)
1476
1477/src/wp-includes/class-wp.php:497
1478/src/wp-includes/class-wp.php:725
1479/tests/phpunit/includes/testcase.php:455
1480/tests/phpunit/tests/query/conditionals.php:36
1481
1482170) Tests_Query_VerbosePageRules::test_permalink
1483ImagickException: Cannot modify header information - headers already sent by (output started at /tests/phpunit/includes/bootstrap.php:56)
1484
1485/src/wp-includes/class-wp.php:497
1486/src/wp-includes/class-wp.php:725
1487/tests/phpunit/includes/testcase.php:455
1488/tests/phpunit/tests/query/conditionals.php:42
1489
1490171) Tests_Query_VerbosePageRules::test_post_comments_feed
1491ImagickException: Cannot modify header information - headers already sent by (output started at /tests/phpunit/includes/bootstrap.php:56)
1492
1493/src/wp-includes/class-wp.php:497
1494/src/wp-includes/class-wp.php:725
1495/tests/phpunit/includes/testcase.php:455
1496/tests/phpunit/tests/query/conditionals.php:49
1497
1498172) Tests_Query_VerbosePageRules::test_post_comments_feed_with_no_comments
1499ImagickException: Cannot modify header information - headers already sent by (output started at /tests/phpunit/includes/bootstrap.php:56)
1500
1501/src/wp-includes/class-wp.php:497
1502/src/wp-includes/class-wp.php:725
1503/tests/phpunit/includes/testcase.php:455
1504/tests/phpunit/tests/query/conditionals.php:56
1505
1506173) Tests_Query_VerbosePageRules::test_attachment_comments_feed
1507ImagickException: Cannot modify header information - headers already sent by (output started at /tests/phpunit/includes/bootstrap.php:56)
1508
1509/src/wp-includes/class-wp.php:497
1510/src/wp-includes/class-wp.php:725
1511/tests/phpunit/includes/testcase.php:455
1512/tests/phpunit/tests/query/conditionals.php:63
1513
1514174) Tests_Query_VerbosePageRules::test_page
1515ImagickException: Cannot modify header information - headers already sent by (output started at /tests/phpunit/includes/bootstrap.php:56)
1516
1517/src/wp-includes/class-wp.php:497
1518/src/wp-includes/class-wp.php:725
1519/tests/phpunit/includes/testcase.php:455
1520/tests/phpunit/tests/query/conditionals.php:69
1521
1522175) Tests_Query_VerbosePageRules::test_parent_page
1523ImagickException: Cannot modify header information - headers already sent by (output started at /tests/phpunit/includes/bootstrap.php:56)
1524
1525/src/wp-includes/class-wp.php:497
1526/src/wp-includes/class-wp.php:725
1527/tests/phpunit/includes/testcase.php:455
1528/tests/phpunit/tests/query/conditionals.php:75
1529
1530176) Tests_Query_VerbosePageRules::test_child_page_1
1531ImagickException: Cannot modify header information - headers already sent by (output started at /tests/phpunit/includes/bootstrap.php:56)
1532
1533/src/wp-includes/class-wp.php:497
1534/src/wp-includes/class-wp.php:725
1535/tests/phpunit/includes/testcase.php:455
1536/tests/phpunit/tests/query/conditionals.php:83
1537
1538177) Tests_Query_VerbosePageRules::test_child_page_2
1539ImagickException: Cannot modify header information - headers already sent by (output started at /tests/phpunit/includes/bootstrap.php:56)
1540
1541/src/wp-includes/class-wp.php:497
1542/src/wp-includes/class-wp.php:725
1543/tests/phpunit/includes/testcase.php:455
1544/tests/phpunit/tests/query/conditionals.php:92
1545
1546178) Tests_Query_VerbosePageRules::test_page_trackback
1547ImagickException: Cannot modify header information - headers already sent by (output started at /tests/phpunit/includes/bootstrap.php:56)
1548
1549/src/wp-includes/class-wp.php:497
1550/src/wp-includes/class-wp.php:725
1551/tests/phpunit/includes/testcase.php:455
1552/tests/phpunit/tests/query/conditionals.php:105
1553
1554179) Tests_Query_VerbosePageRules::test_page_feed
1555ImagickException: Cannot modify header information - headers already sent by (output started at /tests/phpunit/includes/bootstrap.php:56)
1556
1557/src/wp-includes/class-wp.php:497
1558/src/wp-includes/class-wp.php:725
1559/tests/phpunit/includes/testcase.php:455
1560/tests/phpunit/tests/query/conditionals.php:125
1561
1562180) Tests_Query_VerbosePageRules::test_page_feed_with_no_comments
1563ImagickException: Cannot modify header information - headers already sent by (output started at /tests/phpunit/includes/bootstrap.php:56)
1564
1565/src/wp-includes/class-wp.php:497
1566/src/wp-includes/class-wp.php:725
1567/tests/phpunit/includes/testcase.php:455
1568/tests/phpunit/tests/query/conditionals.php:143
1569
1570181) Tests_Query_VerbosePageRules::test_page_feed_atom
1571ImagickException: Cannot modify header information - headers already sent by (output started at /tests/phpunit/includes/bootstrap.php:56)
1572
1573/src/wp-includes/class-wp.php:497
1574/src/wp-includes/class-wp.php:725
1575/tests/phpunit/includes/testcase.php:455
1576/tests/phpunit/tests/query/conditionals.php:164
1577
1578182) Tests_Query_VerbosePageRules::test_page_page_2
1579ImagickException: Cannot modify header information - headers already sent by (output started at /tests/phpunit/includes/bootstrap.php:56)
1580
1581/src/wp-includes/class-wp.php:497
1582/src/wp-includes/class-wp.php:725
1583/tests/phpunit/includes/testcase.php:455
1584/tests/phpunit/tests/query/conditionals.php:178
1585
1586183) Tests_Query_VerbosePageRules::test_page_page_2_no_slash
1587ImagickException: Cannot modify header information - headers already sent by (output started at /tests/phpunit/includes/bootstrap.php:56)
1588
1589/src/wp-includes/class-wp.php:497
1590/src/wp-includes/class-wp.php:725
1591/tests/phpunit/includes/testcase.php:455
1592/tests/phpunit/tests/query/conditionals.php:191
1593
1594184) Tests_Query_VerbosePageRules::test_pagination_of_posts_page
1595ImagickException: Cannot modify header information - headers already sent by (output started at /tests/phpunit/includes/bootstrap.php:56)
1596
1597/src/wp-includes/class-wp.php:497
1598/src/wp-includes/class-wp.php:725
1599/tests/phpunit/includes/testcase.php:455
1600/tests/phpunit/tests/query/conditionals.php:208
1601
1602185) Tests_Query_VerbosePageRules::test_main_feed_2
1603ImagickException: Cannot modify header information - headers already sent by (output started at /tests/phpunit/includes/bootstrap.php:56)
1604
1605/src/wp-includes/class-wp.php:497
1606/src/wp-includes/class-wp.php:725
1607/tests/phpunit/includes/testcase.php:455
1608/tests/phpunit/tests/query/conditionals.php:231
1609
1610186) Tests_Query_VerbosePageRules::test_main_feed
1611ImagickException: Cannot modify header information - headers already sent by (output started at /tests/phpunit/includes/bootstrap.php:56)
1612
1613/src/wp-includes/class-wp.php:497
1614/src/wp-includes/class-wp.php:725
1615/tests/phpunit/includes/testcase.php:455
1616/tests/phpunit/tests/query/conditionals.php:247
1617
1618187) Tests_Query_VerbosePageRules::test_paged
1619ImagickException: Cannot modify header information - headers already sent by (output started at /tests/phpunit/includes/bootstrap.php:56)
1620
1621/src/wp-includes/class-wp.php:497
1622/src/wp-includes/class-wp.php:725
1623/tests/phpunit/includes/testcase.php:455
1624/tests/phpunit/tests/query/conditionals.php:257
1625
1626188) Tests_Query_VerbosePageRules::test_main_comments_feed
1627ImagickException: Cannot modify header information - headers already sent by (output started at /tests/phpunit/includes/bootstrap.php:56)
1628
1629/src/wp-includes/class-wp.php:497
1630/src/wp-includes/class-wp.php:725
1631/tests/phpunit/includes/testcase.php:455
1632/tests/phpunit/tests/query/conditionals.php:269
1633
1634189) Tests_Query_VerbosePageRules::test_search_feed
1635ImagickException: Cannot modify header information - headers already sent by (output started at /tests/phpunit/includes/bootstrap.php:56)
1636
1637/src/wp-includes/class-wp.php:497
1638/src/wp-includes/class-wp.php:725
1639/tests/phpunit/includes/testcase.php:455
1640/tests/phpunit/tests/query/conditionals.php:294
1641
1642190) Tests_Query_VerbosePageRules::test_search_paged
1643ImagickException: Cannot modify header information - headers already sent by (output started at /tests/phpunit/includes/bootstrap.php:56)
1644
1645/src/wp-includes/class-wp.php:497
1646/src/wp-includes/class-wp.php:725
1647/tests/phpunit/includes/testcase.php:455
1648/tests/phpunit/tests/query/conditionals.php:310
1649
1650191) Tests_Query_VerbosePageRules::test_search
1651ImagickException: Cannot modify header information - headers already sent by (output started at /tests/phpunit/includes/bootstrap.php:56)
1652
1653/src/wp-includes/class-wp.php:497
1654/src/wp-includes/class-wp.php:725
1655/tests/phpunit/includes/testcase.php:455
1656/tests/phpunit/tests/query/conditionals.php:316
1657
1658192) Tests_Query_VerbosePageRules::test_search_encoded_chars
1659ImagickException: Cannot modify header information - headers already sent by (output started at /tests/phpunit/includes/bootstrap.php:56)
1660
1661/src/wp-includes/class-wp.php:497
1662/src/wp-includes/class-wp.php:725
1663/tests/phpunit/includes/testcase.php:455
1664/tests/phpunit/tests/query/conditionals.php:324
1665
1666193) Tests_Query_VerbosePageRules::test_category_feed
1667ImagickException: Cannot modify header information - headers already sent by (output started at /tests/phpunit/includes/bootstrap.php:56)
1668
1669/src/wp-includes/class-wp.php:497
1670/src/wp-includes/class-wp.php:725
1671/tests/phpunit/includes/testcase.php:455
1672/tests/phpunit/tests/query/conditionals.php:335
1673
1674194) Tests_Query_VerbosePageRules::test_category_paged
1675ImagickException: Cannot modify header information - headers already sent by (output started at /tests/phpunit/includes/bootstrap.php:56)
1676
1677/src/wp-includes/class-wp.php:497
1678/src/wp-includes/class-wp.php:725
1679/tests/phpunit/includes/testcase.php:455
1680/tests/phpunit/tests/query/conditionals.php:351
1681
1682195) Tests_Query_VerbosePageRules::test_category
1683ImagickException: Cannot modify header information - headers already sent by (output started at /tests/phpunit/includes/bootstrap.php:56)
1684
1685/src/wp-includes/class-wp.php:497
1686/src/wp-includes/class-wp.php:725
1687/tests/phpunit/includes/testcase.php:455
1688/tests/phpunit/tests/query/conditionals.php:358
1689
1690196) Tests_Query_VerbosePageRules::test_tag_feed
1691ImagickException: Cannot modify header information - headers already sent by (output started at /tests/phpunit/includes/bootstrap.php:56)
1692
1693/src/wp-includes/class-wp.php:497
1694/src/wp-includes/class-wp.php:725
1695/tests/phpunit/includes/testcase.php:455
1696/tests/phpunit/tests/query/conditionals.php:369
1697
1698197) Tests_Query_VerbosePageRules::test_tag_paged
1699ImagickException: Cannot modify header information - headers already sent by (output started at /tests/phpunit/includes/bootstrap.php:56)
1700
1701/src/wp-includes/class-wp.php:497
1702/src/wp-includes/class-wp.php:725
1703/tests/phpunit/includes/testcase.php:455
1704/tests/phpunit/tests/query/conditionals.php:387
1705
1706198) Tests_Query_VerbosePageRules::test_tag
1707ImagickException: Cannot modify header information - headers already sent by (output started at /tests/phpunit/includes/bootstrap.php:56)
1708
1709/src/wp-includes/class-wp.php:497
1710/src/wp-includes/class-wp.php:725
1711/tests/phpunit/includes/testcase.php:455
1712/tests/phpunit/tests/query/conditionals.php:394
1713
1714199) Tests_Query_VerbosePageRules::test_author_feed
1715ImagickException: Cannot modify header information - headers already sent by (output started at /tests/phpunit/includes/bootstrap.php:56)
1716
1717/src/wp-includes/class-wp.php:497
1718/src/wp-includes/class-wp.php:725
1719/tests/phpunit/includes/testcase.php:455
1720/tests/phpunit/tests/query/conditionals.php:416
1721
1722200) Tests_Query_VerbosePageRules::test_author_paged
1723ImagickException: Cannot modify header information - headers already sent by (output started at /tests/phpunit/includes/bootstrap.php:56)
1724
1725/src/wp-includes/class-wp.php:497
1726/src/wp-includes/class-wp.php:725
1727/tests/phpunit/includes/testcase.php:455
1728/tests/phpunit/tests/query/conditionals.php:433
1729
1730201) Tests_Query_VerbosePageRules::test_author
1731ImagickException: Cannot modify header information - headers already sent by (output started at /tests/phpunit/includes/bootstrap.php:56)
1732
1733/src/wp-includes/class-wp.php:497
1734/src/wp-includes/class-wp.php:725
1735/tests/phpunit/includes/testcase.php:455
1736/tests/phpunit/tests/query/conditionals.php:441
1737
1738202) Tests_Query_VerbosePageRules::test_author_with_no_posts
1739ImagickException: Cannot modify header information - headers already sent by (output started at /tests/phpunit/includes/bootstrap.php:56)
1740
1741/src/wp-includes/class-wp.php:497
1742/src/wp-includes/class-wp.php:725
1743/tests/phpunit/includes/testcase.php:455
1744/tests/phpunit/tests/query/conditionals.php:447
1745
1746203) Tests_Query_VerbosePageRules::test_ymd_feed
1747ImagickException: Cannot modify header information - headers already sent by (output started at /tests/phpunit/includes/bootstrap.php:56)
1748
1749/src/wp-includes/class-wp.php:497
1750/src/wp-includes/class-wp.php:725
1751/tests/phpunit/includes/testcase.php:455
1752/tests/phpunit/tests/query/conditionals.php:458
1753
1754204) Tests_Query_VerbosePageRules::test_ymd_paged
1755ImagickException: Cannot modify header information - headers already sent by (output started at /tests/phpunit/includes/bootstrap.php:56)
1756
1757/src/wp-includes/class-wp.php:497
1758/src/wp-includes/class-wp.php:725
1759/tests/phpunit/includes/testcase.php:455
1760/tests/phpunit/tests/query/conditionals.php:474
1761
1762205) Tests_Query_VerbosePageRules::test_ymd
1763ImagickException: Cannot modify header information - headers already sent by (output started at /tests/phpunit/includes/bootstrap.php:56)
1764
1765/src/wp-includes/class-wp.php:497
1766/src/wp-includes/class-wp.php:725
1767/tests/phpunit/includes/testcase.php:455
1768/tests/phpunit/tests/query/conditionals.php:481
1769
1770206) Tests_Query_VerbosePageRules::test_ym_feed
1771ImagickException: Cannot modify header information - headers already sent by (output started at /tests/phpunit/includes/bootstrap.php:56)
1772
1773/src/wp-includes/class-wp.php:497
1774/src/wp-includes/class-wp.php:725
1775/tests/phpunit/includes/testcase.php:455
1776/tests/phpunit/tests/query/conditionals.php:492
1777
1778207) Tests_Query_VerbosePageRules::test_ym_paged
1779ImagickException: Cannot modify header information - headers already sent by (output started at /tests/phpunit/includes/bootstrap.php:56)
1780
1781/src/wp-includes/class-wp.php:497
1782/src/wp-includes/class-wp.php:725
1783/tests/phpunit/includes/testcase.php:455
1784/tests/phpunit/tests/query/conditionals.php:508
1785
1786208) Tests_Query_VerbosePageRules::test_ym
1787ImagickException: Cannot modify header information - headers already sent by (output started at /tests/phpunit/includes/bootstrap.php:56)
1788
1789/src/wp-includes/class-wp.php:497
1790/src/wp-includes/class-wp.php:725
1791/tests/phpunit/includes/testcase.php:455
1792/tests/phpunit/tests/query/conditionals.php:515
1793
1794209) Tests_Query_VerbosePageRules::test_y_feed
1795ImagickException: Cannot modify header information - headers already sent by (output started at /tests/phpunit/includes/bootstrap.php:56)
1796
1797/src/wp-includes/class-wp.php:497
1798/src/wp-includes/class-wp.php:725
1799/tests/phpunit/includes/testcase.php:455
1800/tests/phpunit/tests/query/conditionals.php:526
1801
1802210) Tests_Query_VerbosePageRules::test_y_paged
1803ImagickException: Cannot modify header information - headers already sent by (output started at /tests/phpunit/includes/bootstrap.php:56)
1804
1805/src/wp-includes/class-wp.php:497
1806/src/wp-includes/class-wp.php:725
1807/tests/phpunit/includes/testcase.php:455
1808/tests/phpunit/tests/query/conditionals.php:542
1809
1810211) Tests_Query_VerbosePageRules::test_y
1811ImagickException: Cannot modify header information - headers already sent by (output started at /tests/phpunit/includes/bootstrap.php:56)
1812
1813/src/wp-includes/class-wp.php:497
1814/src/wp-includes/class-wp.php:725
1815/tests/phpunit/includes/testcase.php:455
1816/tests/phpunit/tests/query/conditionals.php:549
1817
1818212) Tests_Query_VerbosePageRules::test_post_trackback
1819ImagickException: Cannot modify header information - headers already sent by (output started at /tests/phpunit/includes/bootstrap.php:56)
1820
1821/src/wp-includes/class-wp.php:497
1822/src/wp-includes/class-wp.php:725
1823/tests/phpunit/includes/testcase.php:455
1824/tests/phpunit/tests/query/conditionals.php:557
1825
1826213) Tests_Query_VerbosePageRules::test_post_comment_feed
1827ImagickException: Cannot modify header information - headers already sent by (output started at /tests/phpunit/includes/bootstrap.php:56)
1828
1829/src/wp-includes/class-wp.php:497
1830/src/wp-includes/class-wp.php:725
1831/tests/phpunit/includes/testcase.php:455
1832/tests/phpunit/tests/query/conditionals.php:569
1833
1834214) Tests_Query_VerbosePageRules::test_post_paged_short
1835ImagickException: Cannot modify header information - headers already sent by (output started at /tests/phpunit/includes/bootstrap.php:56)
1836
1837/src/wp-includes/class-wp.php:497
1838/src/wp-includes/class-wp.php:725
1839/tests/phpunit/includes/testcase.php:455
1840/tests/phpunit/tests/query/conditionals.php:588
1841
1842215) Tests_Query_VerbosePageRules::test_post_attachment
1843ImagickException: Cannot modify header information - headers already sent by (output started at /tests/phpunit/includes/bootstrap.php:56)
1844
1845/src/wp-includes/class-wp.php:497
1846/src/wp-includes/class-wp.php:725
1847/tests/phpunit/includes/testcase.php:455
1848/tests/phpunit/tests/query/conditionals.php:598
1849
1850216) Tests_Query_VerbosePageRules::test_bad_dates
1851ImagickException: Cannot modify header information - headers already sent by (output started at /tests/phpunit/includes/bootstrap.php:56)
1852
1853/src/wp-includes/class-wp.php:497
1854/src/wp-includes/class-wp.php:725
1855/tests/phpunit/includes/testcase.php:455
1856/tests/phpunit/tests/query/conditionals.php:614
1857
1858217) Tests_Query_VerbosePageRules::test_post_type_archive_with_tax_query
1859ImagickException: Cannot modify header information - headers already sent by (output started at /tests/phpunit/includes/bootstrap.php:56)
1860
1861/src/wp-includes/class-wp.php:497
1862/src/wp-includes/class-wp.php:725
1863/tests/phpunit/includes/testcase.php:455
1864/tests/phpunit/tests/query/conditionals.php:636
1865
1866218) Tests_Query_VerbosePageRules::test_post_type_array
1867ImagickException: Cannot modify header information - headers already sent by (output started at /tests/phpunit/includes/bootstrap.php:56)
1868
1869/src/wp-includes/class-wp.php:497
1870/src/wp-includes/class-wp.php:725
1871/tests/phpunit/includes/testcase.php:455
1872/tests/phpunit/tests/query/conditionals.php:668
1873
1874219) Tests_Query_VerbosePageRules::test_is_single
1875ImagickException: Cannot modify header information - headers already sent by (output started at /tests/phpunit/includes/bootstrap.php:56)
1876
1877/src/wp-includes/class-wp.php:497
1878/src/wp-includes/class-wp.php:725
1879/tests/phpunit/includes/testcase.php:455
1880/tests/phpunit/tests/query/conditionals.php:687
1881
1882220) Tests_Query_VerbosePageRules::test_is_single_with_parent
1883ImagickException: Cannot modify header information - headers already sent by (output started at /tests/phpunit/includes/bootstrap.php:56)
1884
1885/src/wp-includes/class-wp.php:497
1886/src/wp-includes/class-wp.php:725
1887/tests/phpunit/includes/testcase.php:455
1888/tests/phpunit/tests/query/conditionals.php:729
1889
1890221) Tests_Query_VerbosePageRules::test_is_single_with_slug_that_begins_with_a_number_that_clashes_with_another_post_id
1891ImagickException: Cannot modify header information - headers already sent by (output started at /tests/phpunit/includes/bootstrap.php:56)
1892
1893/src/wp-includes/class-wp.php:497
1894/src/wp-includes/class-wp.php:725
1895/tests/phpunit/includes/testcase.php:455
1896/tests/phpunit/tests/query/conditionals.php:760
1897
1898222) Tests_Query_VerbosePageRules::test_is_single_with_slug_that_clashes_with_attachment
1899ImagickException: Cannot modify header information - headers already sent by (output started at /tests/phpunit/includes/bootstrap.php:56)
1900
1901/src/wp-includes/class-wp.php:497
1902/src/wp-includes/class-wp.php:725
1903/tests/phpunit/includes/testcase.php:455
1904/tests/phpunit/tests/query/conditionals.php:784
1905
1906223) Tests_Query_VerbosePageRules::test_is_page
1907ImagickException: Cannot modify header information - headers already sent by (output started at /tests/phpunit/includes/bootstrap.php:56)
1908
1909/src/wp-includes/class-wp.php:497
1910/src/wp-includes/class-wp.php:725
1911/tests/phpunit/includes/testcase.php:455
1912/tests/phpunit/tests/query/conditionals.php:798
1913
1914224) Tests_Query_VerbosePageRules::test_is_page_with_parent
1915ImagickException: Cannot modify header information - headers already sent by (output started at /tests/phpunit/includes/bootstrap.php:56)
1916
1917/src/wp-includes/class-wp.php:497
1918/src/wp-includes/class-wp.php:725
1919/tests/phpunit/includes/testcase.php:455
1920/tests/phpunit/tests/query/conditionals.php:826
1921
1922225) Tests_Query_VerbosePageRules::test_is_attachment
1923ImagickException: Cannot modify header information - headers already sent by (output started at /tests/phpunit/includes/bootstrap.php:56)
1924
1925/src/wp-includes/class-wp.php:497
1926/src/wp-includes/class-wp.php:725
1927/tests/phpunit/includes/testcase.php:455
1928/tests/phpunit/tests/query/conditionals.php:848
1929
1930226) Tests_Query_VerbosePageRules::test_is_attachment_with_slug_that_begins_with_a_number_that_clashes_with_a_page_ID
1931ImagickException: Cannot modify header information - headers already sent by (output started at /tests/phpunit/includes/bootstrap.php:56)
1932
1933/src/wp-includes/class-wp.php:497
1934/src/wp-includes/class-wp.php:725
1935/tests/phpunit/includes/testcase.php:455
1936/tests/phpunit/tests/query/conditionals.php:876
1937
1938227) Tests_Query_VerbosePageRules::test_is_author_with_nicename_that_begins_with_a_number_that_clashes_with_another_author_id
1939ImagickException: Cannot modify header information - headers already sent by (output started at /tests/phpunit/includes/bootstrap.php:56)
1940
1941/src/wp-includes/class-wp.php:497
1942/src/wp-includes/class-wp.php:725
1943/tests/phpunit/includes/testcase.php:455
1944/tests/phpunit/tests/query/conditionals.php:897
1945
1946228) Tests_Query_VerbosePageRules::test_is_category_with_slug_that_begins_with_a_number_that_clashes_with_another_category_id
1947ImagickException: Cannot modify header information - headers already sent by (output started at /tests/phpunit/includes/bootstrap.php:56)
1948
1949/src/wp-includes/class-wp.php:497
1950/src/wp-includes/class-wp.php:725
1951/tests/phpunit/includes/testcase.php:455
1952/tests/phpunit/tests/query/conditionals.php:918
1953
1954229) Tests_Query_VerbosePageRules::test_is_tag_with_slug_that_begins_with_a_number_that_clashes_with_another_tag_id
1955ImagickException: Cannot modify header information - headers already sent by (output started at /tests/phpunit/includes/bootstrap.php:56)
1956
1957/src/wp-includes/class-wp.php:497
1958/src/wp-includes/class-wp.php:725
1959/tests/phpunit/includes/testcase.php:455
1960/tests/phpunit/tests/query/conditionals.php:939
1961
1962230) Tests_Query_VerbosePageRules::test_is_page_with_page_id_zero_and_random_page_slug
1963ImagickException: Cannot modify header information - headers already sent by (output started at /tests/phpunit/includes/bootstrap.php:56)
1964
1965/src/wp-includes/class-wp.php:497
1966/src/wp-includes/class-wp.php:725
1967/tests/phpunit/includes/testcase.php:455
1968/tests/phpunit/tests/query/conditionals.php:954
1969
1970231) Tests_Query_VerbosePageRules::test_is_page_with_page_slug_that_begins_with_a_number_that_clashes_with_a_page_ID
1971ImagickException: Cannot modify header information - headers already sent by (output started at /tests/phpunit/includes/bootstrap.php:56)
1972
1973/src/wp-includes/class-wp.php:497
1974/src/wp-includes/class-wp.php:725
1975/tests/phpunit/includes/testcase.php:455
1976/tests/phpunit/tests/query/conditionals.php:983
1977
1978232) Tests_Query_VerbosePageRules::test_is_page_template
1979ImagickException: Cannot modify header information - headers already sent by (output started at /tests/phpunit/includes/bootstrap.php:56)
1980
1981/src/wp-includes/class-wp.php:497
1982/src/wp-includes/class-wp.php:725
1983/tests/phpunit/includes/testcase.php:455
1984/tests/phpunit/tests/query/conditionals.php:996
1985
1986233) Tests_Query_VerbosePageRules::test_is_page_template_default
1987ImagickException: Cannot modify header information - headers already sent by (output started at /tests/phpunit/includes/bootstrap.php:56)
1988
1989/src/wp-includes/class-wp.php:497
1990/src/wp-includes/class-wp.php:725
1991/tests/phpunit/includes/testcase.php:455
1992/tests/phpunit/tests/query/conditionals.php:1005
1993
1994234) Tests_Query_VerbosePageRules::test_is_page_template_array
1995ImagickException: Cannot modify header information - headers already sent by (output started at /tests/phpunit/includes/bootstrap.php:56)
1996
1997/src/wp-includes/class-wp.php:497
1998/src/wp-includes/class-wp.php:725
1999/tests/phpunit/includes/testcase.php:455
2000/tests/phpunit/tests/query/conditionals.php:1016
2001
2002235) Tests_Query_VerbosePageRules::test_is_attachment_should_not_match_numeric_id_to_post_title_beginning_with_id
2003ImagickException: Cannot modify header information - headers already sent by (output started at /tests/phpunit/includes/bootstrap.php:56)
2004
2005/src/wp-includes/class-wp.php:497
2006/src/wp-includes/class-wp.php:725
2007/tests/phpunit/includes/testcase.php:455
2008/tests/phpunit/tests/query/conditionals.php:1036
2009
2010236) Tests_Query_VerbosePageRules::test_is_attachment_should_not_match_numeric_id_to_post_name_beginning_with_id
2011ImagickException: Cannot modify header information - headers already sent by (output started at /tests/phpunit/includes/bootstrap.php:56)
2012
2013/src/wp-includes/class-wp.php:497
2014/src/wp-includes/class-wp.php:725
2015/tests/phpunit/includes/testcase.php:455
2016/tests/phpunit/tests/query/conditionals.php:1057
2017
2018237) Tests_Query_VerbosePageRules::test_is_author_should_not_match_numeric_id_to_nickname_beginning_with_id
2019ImagickException: Cannot modify header information - headers already sent by (output started at /tests/phpunit/includes/bootstrap.php:56)
2020
2021/src/wp-includes/class-wp.php:497
2022/src/wp-includes/class-wp.php:725
2023/tests/phpunit/includes/testcase.php:455
2024/tests/phpunit/tests/query/conditionals.php:1076
2025
2026238) Tests_Query_VerbosePageRules::test_is_author_should_not_match_numeric_id_to_user_nicename_beginning_with_id
2027ImagickException: Cannot modify header information - headers already sent by (output started at /tests/phpunit/includes/bootstrap.php:56)
2028
2029/src/wp-includes/class-wp.php:497
2030/src/wp-includes/class-wp.php:725
2031/tests/phpunit/includes/testcase.php:455
2032/tests/phpunit/tests/query/conditionals.php:1095
2033
2034239) Tests_Query_VerbosePageRules::test_is_category_should_not_match_numeric_id_to_name_beginning_with_id
2035ImagickException: Cannot modify header information - headers already sent by (output started at /tests/phpunit/includes/bootstrap.php:56)
2036
2037/src/wp-includes/class-wp.php:497
2038/src/wp-includes/class-wp.php:725
2039/tests/phpunit/includes/testcase.php:455
2040/tests/phpunit/tests/query/conditionals.php:1116
2041
2042240) Tests_Query_VerbosePageRules::test_is_category_should_not_match_numeric_id_to_slug_beginning_with_id
2043ImagickException: Cannot modify header information - headers already sent by (output started at /tests/phpunit/includes/bootstrap.php:56)
2044
2045/src/wp-includes/class-wp.php:497
2046/src/wp-includes/class-wp.php:725
2047/tests/phpunit/includes/testcase.php:455
2048/tests/phpunit/tests/query/conditionals.php:1137
2049
2050241) Tests_Query_VerbosePageRules::test_is_tag_should_not_match_numeric_id_to_name_beginning_with_id
2051ImagickException: Cannot modify header information - headers already sent by (output started at /tests/phpunit/includes/bootstrap.php:56)
2052
2053/src/wp-includes/class-wp.php:497
2054/src/wp-includes/class-wp.php:725
2055/tests/phpunit/includes/testcase.php:455
2056/tests/phpunit/tests/query/conditionals.php:1158
2057
2058242) Tests_Query_VerbosePageRules::test_is_tag_should_not_match_numeric_id_to_slug_beginning_with_id
2059ImagickException: Cannot modify header information - headers already sent by (output started at /tests/phpunit/includes/bootstrap.php:56)
2060
2061/src/wp-includes/class-wp.php:497
2062/src/wp-includes/class-wp.php:725
2063/tests/phpunit/includes/testcase.php:455
2064/tests/phpunit/tests/query/conditionals.php:1179
2065
2066243) Tests_Query_VerbosePageRules::test_is_page_should_not_match_numeric_id_to_post_title_beginning_with_id
2067ImagickException: Cannot modify header information - headers already sent by (output started at /tests/phpunit/includes/bootstrap.php:56)
2068
2069/src/wp-includes/class-wp.php:497
2070/src/wp-includes/class-wp.php:725
2071/tests/phpunit/includes/testcase.php:455
2072/tests/phpunit/tests/query/conditionals.php:1200
2073
2074244) Tests_Query_VerbosePageRules::test_is_page_should_not_match_numeric_id_to_post_name_beginning_with_id
2075ImagickException: Cannot modify header information - headers already sent by (output started at /tests/phpunit/includes/bootstrap.php:56)
2076
2077/src/wp-includes/class-wp.php:497
2078/src/wp-includes/class-wp.php:725
2079/tests/phpunit/includes/testcase.php:455
2080/tests/phpunit/tests/query/conditionals.php:1221
2081
2082245) Tests_Query_VerbosePageRules::test_is_single_should_not_match_numeric_id_to_post_title_beginning_with_id
2083ImagickException: Cannot modify header information - headers already sent by (output started at /tests/phpunit/includes/bootstrap.php:56)
2084
2085/src/wp-includes/class-wp.php:497
2086/src/wp-includes/class-wp.php:725
2087/tests/phpunit/includes/testcase.php:455
2088/tests/phpunit/tests/query/conditionals.php:1242
2089
2090246) Tests_Query_VerbosePageRules::test_is_single_should_not_match_numeric_id_to_post_name_beginning_with_id
2091ImagickException: Cannot modify header information - headers already sent by (output started at /tests/phpunit/includes/bootstrap.php:56)
2092
2093/src/wp-includes/class-wp.php:497
2094/src/wp-includes/class-wp.php:725
2095/tests/phpunit/includes/testcase.php:455
2096/tests/phpunit/tests/query/conditionals.php:1263
2097
2098247) Tests_REST_Server::test_nocache_headers_on_authenticated_requests
2099ImagickException: Cannot modify header information - headers already sent by (output started at /tests/phpunit/includes/bootstrap.php:56)
2100
2101/src/wp-includes/functions.php:1083
2102/src/wp-includes/rest-api/class-wp-rest-server.php:1175
2103/src/wp-includes/rest-api/class-wp-rest-server.php:361
2104/tests/phpunit/includes/spy-rest-server.php:47
2105/tests/phpunit/tests/rest-api/rest-server.php:725
2106
2107248) Tests_REST_Server::test_no_nocache_headers_on_unauthenticated_requests
2108ImagickException: Cannot modify header information - headers already sent by (output started at /tests/phpunit/includes/bootstrap.php:56)
2109
2110/src/wp-includes/functions.php:1083
2111/src/wp-includes/rest-api/class-wp-rest-server.php:1175
2112/src/wp-includes/rest-api/class-wp-rest-server.php:361
2113/tests/phpunit/includes/spy-rest-server.php:47
2114/tests/phpunit/tests/rest-api/rest-server.php:738
2115
2116249) Tests_REST_Server::test_serve_request_url_params_are_unslashed
2117ImagickException: Cannot modify header information - headers already sent by (output started at /tests/phpunit/includes/bootstrap.php:56)
2118
2119/src/wp-includes/functions.php:1083
2120/src/wp-includes/rest-api/class-wp-rest-server.php:1175
2121/src/wp-includes/rest-api/class-wp-rest-server.php:361
2122/tests/phpunit/includes/spy-rest-server.php:47
2123/tests/phpunit/tests/rest-api/rest-server.php:758
2124
2125250) Tests_REST_Server::test_serve_request_query_params_are_unslashed
2126ImagickException: Cannot modify header information - headers already sent by (output started at /tests/phpunit/includes/bootstrap.php:56)
2127
2128/src/wp-includes/functions.php:1083
2129/src/wp-includes/rest-api/class-wp-rest-server.php:1175
2130/src/wp-includes/rest-api/class-wp-rest-server.php:361
2131/tests/phpunit/includes/spy-rest-server.php:47
2132/tests/phpunit/tests/rest-api/rest-server.php:780
2133
2134251) Tests_REST_Server::test_serve_request_body_params_are_unslashed
2135ImagickException: Cannot modify header information - headers already sent by (output started at /tests/phpunit/includes/bootstrap.php:56)
2136
2137/src/wp-includes/functions.php:1083
2138/src/wp-includes/rest-api/class-wp-rest-server.php:1175
2139/src/wp-includes/rest-api/class-wp-rest-server.php:361
2140/tests/phpunit/includes/spy-rest-server.php:47
2141/tests/phpunit/tests/rest-api/rest-server.php:802
2142
2143252) Tests_REST_Server::test_serve_request_json_params_are_unslashed
2144ImagickException: Cannot modify header information - headers already sent by (output started at /tests/phpunit/includes/bootstrap.php:56)
2145
2146/src/wp-includes/functions.php:1083
2147/src/wp-includes/rest-api/class-wp-rest-server.php:1175
2148/src/wp-includes/rest-api/class-wp-rest-server.php:361
2149/tests/phpunit/includes/spy-rest-server.php:47
2150/tests/phpunit/tests/rest-api/rest-server.php:825
2151
2152253) Tests_REST_Server::test_serve_request_file_params_are_unslashed
2153ImagickException: Cannot modify header information - headers already sent by (output started at /tests/phpunit/includes/bootstrap.php:56)
2154
2155/src/wp-includes/functions.php:1083
2156/src/wp-includes/rest-api/class-wp-rest-server.php:1175
2157/src/wp-includes/rest-api/class-wp-rest-server.php:361
2158/tests/phpunit/includes/spy-rest-server.php:47
2159/tests/phpunit/tests/rest-api/rest-server.php:849
2160
2161254) Tests_REST_Server::test_serve_request_headers_are_unslashed
2162ImagickException: Cannot modify header information - headers already sent by (output started at /tests/phpunit/includes/bootstrap.php:56)
2163
2164/src/wp-includes/functions.php:1083
2165/src/wp-includes/rest-api/class-wp-rest-server.php:1175
2166/src/wp-includes/rest-api/class-wp-rest-server.php:361
2167/tests/phpunit/includes/spy-rest-server.php:47
2168/tests/phpunit/tests/rest-api/rest-server.php:869
2169
2170255) Tests_Rewrite::test_parse_request_home_path
2171ImagickException: Cannot modify header information - headers already sent by (output started at /tests/phpunit/includes/bootstrap.php:56)
2172
2173/src/wp-includes/class-wp.php:497
2174/src/wp-includes/class-wp.php:725
2175/tests/phpunit/includes/testcase.php:455
2176/tests/phpunit/tests/rewrite.php:252
2177
2178256) Tests_Rewrite::test_parse_request_home_path_with_regex_character
2179ImagickException: Cannot modify header information - headers already sent by (output started at /tests/phpunit/includes/bootstrap.php:56)
2180
2181/src/wp-includes/class-wp.php:497
2182/src/wp-includes/class-wp.php:725
2183/tests/phpunit/includes/testcase.php:455
2184/tests/phpunit/tests/rewrite.php:267
2185
2186257) Tests_Rewrite::test_parse_request_home_path_non_public_type
2187ImagickException: Cannot modify header information - headers already sent by (output started at /tests/phpunit/includes/bootstrap.php:56)
2188
2189/src/wp-includes/class-wp.php:497
2190/src/wp-includes/class-wp.php:725
2191/tests/phpunit/includes/testcase.php:455
2192/tests/phpunit/tests/rewrite.php:286
2193
2194258) Tests_Rewrite::test_parse_request_with_post_slug_that_clashes_with_a_trashed_page
2195ImagickException: Cannot modify header information - headers already sent by (output started at /tests/phpunit/includes/bootstrap.php:56)
2196
2197/src/wp-includes/class-wp.php:497
2198/src/wp-includes/class-wp.php:725
2199/tests/phpunit/includes/testcase.php:455
2200/tests/phpunit/tests/rewrite.php:384
2201
2202259) Tests_Rewrite_AddRewriteEndpoint::test_is_home_should_be_false_when_visiting_custom_endpoint_without_a_registered_query_var_and_page_on_front_is_set
2203ImagickException: Cannot modify header information - headers already sent by (output started at /tests/phpunit/includes/bootstrap.php:56)
2204
2205/src/wp-includes/class-wp.php:497
2206/src/wp-includes/class-wp.php:725
2207/tests/phpunit/includes/testcase.php:455
2208/tests/phpunit/tests/rewrite/addRewriteEndpoint.php:79
2209
2210260) Tests_Rewrite_AddRewriteEndpoint::test_permalink_endpoint_only_applies_on_permalink
2211ImagickException: Cannot modify header information - headers already sent by (output started at /tests/phpunit/includes/bootstrap.php:56)
2212
2213/src/wp-includes/class-wp.php:497
2214/src/wp-includes/class-wp.php:725
2215/tests/phpunit/includes/testcase.php:455
2216/tests/phpunit/tests/rewrite/addRewriteEndpoint.php:89
2217
2218261) Tests_Rewrite_AddRewriteEndpoint::test_page_endpoint_only_applies_on_page
2219ImagickException: Cannot modify header information - headers already sent by (output started at /tests/phpunit/includes/bootstrap.php:56)
2220
2221/src/wp-includes/class-wp.php:497
2222/src/wp-includes/class-wp.php:725
2223/tests/phpunit/includes/testcase.php:455
2224/tests/phpunit/tests/rewrite/addRewriteEndpoint.php:104
2225
2226262) Tests_Rewrite_NumericSlugs::test_go_to_year_segment_collision_without_title
2227ImagickException: Cannot modify header information - headers already sent by (output started at /tests/phpunit/includes/bootstrap.php:56)
2228
2229/src/wp-includes/class-wp.php:497
2230/src/wp-includes/class-wp.php:725
2231/tests/phpunit/includes/testcase.php:455
2232/tests/phpunit/tests/rewrite/numericSlugs.php:45
2233
2234263) Tests_Rewrite_NumericSlugs::test_go_to_year_segment_collision_with_title
2235ImagickException: Cannot modify header information - headers already sent by (output started at /tests/phpunit/includes/bootstrap.php:56)
2236
2237/src/wp-includes/class-wp.php:497
2238/src/wp-includes/class-wp.php:725
2239/tests/phpunit/includes/testcase.php:455
2240/tests/phpunit/tests/rewrite/numericSlugs.php:87
2241
2242264) Tests_Rewrite_NumericSlugs::test_go_to_month_segment_collision_without_title
2243ImagickException: Cannot modify header information - headers already sent by (output started at /tests/phpunit/includes/bootstrap.php:56)
2244
2245/src/wp-includes/class-wp.php:497
2246/src/wp-includes/class-wp.php:725
2247/tests/phpunit/includes/testcase.php:455
2248/tests/phpunit/tests/rewrite/numericSlugs.php:118
2249
2250265) Tests_Rewrite_NumericSlugs::test_go_to_month_segment_collision_without_title_no_leading_zero
2251ImagickException: Cannot modify header information - headers already sent by (output started at /tests/phpunit/includes/bootstrap.php:56)
2252
2253/src/wp-includes/class-wp.php:497
2254/src/wp-includes/class-wp.php:725
2255/tests/phpunit/includes/testcase.php:455
2256/tests/phpunit/tests/rewrite/numericSlugs.php:150
2257
2258266) Tests_Rewrite_NumericSlugs::test_go_to_month_segment_collision_with_title
2259ImagickException: Cannot modify header information - headers already sent by (output started at /tests/phpunit/includes/bootstrap.php:56)
2260
2261/src/wp-includes/class-wp.php:497
2262/src/wp-includes/class-wp.php:725
2263/tests/phpunit/includes/testcase.php:455
2264/tests/phpunit/tests/rewrite/numericSlugs.php:181
2265
2266267) Tests_Rewrite_NumericSlugs::test_go_to_month_segment_collision_with_title_no_leading_zero
2267ImagickException: Cannot modify header information - headers already sent by (output started at /tests/phpunit/includes/bootstrap.php:56)
2268
2269/src/wp-includes/class-wp.php:497
2270/src/wp-includes/class-wp.php:725
2271/tests/phpunit/includes/testcase.php:455
2272/tests/phpunit/tests/rewrite/numericSlugs.php:211
2273
2274268) Tests_Rewrite_NumericSlugs::test_go_to_day_segment_collision_without_title
2275ImagickException: Cannot modify header information - headers already sent by (output started at /tests/phpunit/includes/bootstrap.php:56)
2276
2277/src/wp-includes/class-wp.php:497
2278/src/wp-includes/class-wp.php:725
2279/tests/phpunit/includes/testcase.php:455
2280/tests/phpunit/tests/rewrite/numericSlugs.php:242
2281
2282269) Tests_Rewrite_NumericSlugs::test_go_to_day_segment_collision_with_title
2283ImagickException: Cannot modify header information - headers already sent by (output started at /tests/phpunit/includes/bootstrap.php:56)
2284
2285/src/wp-includes/class-wp.php:497
2286/src/wp-includes/class-wp.php:725
2287/tests/phpunit/includes/testcase.php:455
2288/tests/phpunit/tests/rewrite/numericSlugs.php:273
2289
2290270) Tests_Rewrite_NumericSlugs::test_month_slug_collision_should_resolve_to_date_archive_when_year_does_not_match_post_year
2291ImagickException: Cannot modify header information - headers already sent by (output started at /tests/phpunit/includes/bootstrap.php:56)
2292
2293/src/wp-includes/class-wp.php:497
2294/src/wp-includes/class-wp.php:725
2295/tests/phpunit/includes/testcase.php:455
2296/tests/phpunit/tests/rewrite/numericSlugs.php:336
2297
2298271) Tests_Rewrite_NumericSlugs::test_day_slug_collision_should_resolve_to_date_archive_when_monthnum_does_not_match_post_month
2299ImagickException: Cannot modify header information - headers already sent by (output started at /tests/phpunit/includes/bootstrap.php:56)
2300
2301/src/wp-includes/class-wp.php:497
2302/src/wp-includes/class-wp.php:725
2303/tests/phpunit/includes/testcase.php:455
2304/tests/phpunit/tests/rewrite/numericSlugs.php:364
2305
2306272) Tests_Rewrite_NumericSlugs::test_date_slug_collision_should_distinguish_valid_pagination_from_date
2307ImagickException: Cannot modify header information - headers already sent by (output started at /tests/phpunit/includes/bootstrap.php:56)
2308
2309/src/wp-includes/class-wp.php:497
2310/src/wp-includes/class-wp.php:725
2311/tests/phpunit/includes/testcase.php:455
2312/tests/phpunit/tests/rewrite/numericSlugs.php:380
2313
2314273) Tests_Rewrite_NumericSlugs::test_date_slug_collision_should_distinguish_too_high_pagination_from_date
2315ImagickException: Cannot modify header information - headers already sent by (output started at /tests/phpunit/includes/bootstrap.php:56)
2316
2317/src/wp-includes/class-wp.php:497
2318/src/wp-includes/class-wp.php:725
2319/tests/phpunit/includes/testcase.php:455
2320/tests/phpunit/tests/rewrite/numericSlugs.php:396
2321
2322274) Tests_Rewrite_NumericSlugs::test_date_slug_collision_should_not_require_pagination_query_var
2323ImagickException: Cannot modify header information - headers already sent by (output started at /tests/phpunit/includes/bootstrap.php:56)
2324
2325/src/wp-includes/class-wp.php:497
2326/src/wp-includes/class-wp.php:725
2327/tests/phpunit/includes/testcase.php:455
2328/tests/phpunit/tests/rewrite/numericSlugs.php:412
2329
2330275) Tests_Rewrite_NumericSlugs::test_date_slug_collision_should_be_ignored_when_pagination_var_is_present_but_post_does_not_have_multiple_pages
2331ImagickException: Cannot modify header information - headers already sent by (output started at /tests/phpunit/includes/bootstrap.php:56)
2332
2333/src/wp-includes/class-wp.php:497
2334/src/wp-includes/class-wp.php:725
2335/tests/phpunit/includes/testcase.php:455
2336/tests/phpunit/tests/rewrite/numericSlugs.php:429
2337
2338276) Tests_Rewrite_OldSlugRedirect::test_old_slug_redirect
2339ImagickException: Cannot modify header information - headers already sent by (output started at /tests/phpunit/includes/bootstrap.php:56)
2340
2341/src/wp-includes/class-wp.php:497
2342/src/wp-includes/class-wp.php:725
2343/tests/phpunit/includes/testcase.php:455
2344/tests/phpunit/tests/rewrite/oldSlugRedirect.php:48
2345
2346277) Tests_Rewrite_OldSlugRedirect::test_old_slug_redirect_attachment
2347ImagickException: Cannot modify header information - headers already sent by (output started at /tests/phpunit/includes/bootstrap.php:56)
2348
2349/src/wp-includes/class-wp.php:497
2350/src/wp-includes/class-wp.php:725
2351/tests/phpunit/includes/testcase.php:455
2352/tests/phpunit/tests/rewrite/oldSlugRedirect.php:67
2353
2354278) Tests_Rewrite_OldSlugRedirect::test_old_slug_redirect_paged
2355ImagickException: Cannot modify header information - headers already sent by (output started at /tests/phpunit/includes/bootstrap.php:56)
2356
2357/src/wp-includes/class-wp.php:497
2358/src/wp-includes/class-wp.php:725
2359/tests/phpunit/includes/testcase.php:455
2360/tests/phpunit/tests/rewrite/oldSlugRedirect.php:101
2361
2362279) Tests_Rewrite_OldSlugRedirect::test_old_slug_doesnt_redirect_when_reused
2363ImagickException: Cannot modify header information - headers already sent by (output started at /tests/phpunit/includes/bootstrap.php:56)
2364
2365/src/wp-includes/class-wp.php:497
2366/src/wp-includes/class-wp.php:725
2367/tests/phpunit/includes/testcase.php:455
2368/tests/phpunit/tests/rewrite/oldSlugRedirect.php:126
2369
2370280) Tests_Shortcode::test_footag_default
2371ImagickException: Illegal string offset 'foo'
2372
2373/tests/phpunit/tests/shortcode.php:40
2374/src/wp-includes/shortcodes.php:326
2375/src/wp-includes/shortcodes.php:223
2376/tests/phpunit/tests/shortcode.php:215
2377
2378281) Tests_Shortcode::test_tag_not_escaped
2379ImagickException: Illegal string offset 'foo'
2380
2381/tests/phpunit/tests/shortcode.php:40
2382/src/wp-includes/shortcodes.php:326
2383/src/wp-includes/shortcodes.php:223
2384/tests/phpunit/tests/shortcode.php:251
2385
2386282) Tests_Taxonomy::test_nonpublicly_queryable_taxonomy_should_not_be_queryable_using_taxname_query_var
2387ImagickException: Cannot modify header information - headers already sent by (output started at /tests/phpunit/includes/bootstrap.php:56)
2388
2389/src/wp-includes/class-wp.php:497
2390/src/wp-includes/class-wp.php:725
2391/tests/phpunit/includes/testcase.php:455
2392/tests/phpunit/tests/taxonomy.php:461
2393
2394283) Tests_Taxonomy::test_it_should_be_possible_to_register_a_query_var_that_matches_the_name_of_a_nonpublicly_queryable_taxonomy
2395ImagickException: Cannot modify header information - headers already sent by (output started at /tests/phpunit/includes/bootstrap.php:56)
2396
2397/src/wp-includes/class-wp.php:497
2398/src/wp-includes/class-wp.php:725
2399/tests/phpunit/includes/testcase.php:455
2400/tests/phpunit/tests/taxonomy.php:483
2401
2402284) Tests_Taxonomy::test_nonpublicly_queryable_taxonomy_should_not_be_queryable_using_taxonomy_and_term_vars
2403ImagickException: Cannot modify header information - headers already sent by (output started at /tests/phpunit/includes/bootstrap.php:56)
2404
2405/src/wp-includes/class-wp.php:497
2406/src/wp-includes/class-wp.php:725
2407/tests/phpunit/includes/testcase.php:455
2408/tests/phpunit/tests/taxonomy.php:516
2409
2410285) Tests_Taxonomy::test_public_taxonomy_should_be_publicly_queryable
2411ImagickException: Cannot modify header information - headers already sent by (output started at /tests/phpunit/includes/bootstrap.php:56)
2412
2413/src/wp-includes/class-wp.php:497
2414/src/wp-includes/class-wp.php:725
2415/tests/phpunit/includes/testcase.php:455
2416/tests/phpunit/tests/taxonomy.php:538
2417
2418286) Tests_Taxonomy::test_private_taxonomy_should_not_be_publicly_queryable
2419ImagickException: Cannot modify header information - headers already sent by (output started at /tests/phpunit/includes/bootstrap.php:56)
2420
2421/src/wp-includes/class-wp.php:497
2422/src/wp-includes/class-wp.php:725
2423/tests/phpunit/includes/testcase.php:455
2424/tests/phpunit/tests/taxonomy.php:560
2425
2426287) Tests_Taxonomy::test_private_taxonomy_should_be_overridden_by_publicly_queryable
2427ImagickException: Cannot modify header information - headers already sent by (output started at /tests/phpunit/includes/bootstrap.php:56)
2428
2429/src/wp-includes/class-wp.php:497
2430/src/wp-includes/class-wp.php:725
2431/tests/phpunit/includes/testcase.php:455
2432/tests/phpunit/tests/taxonomy.php:583
2433
2434288) Tests_Term_Meta::test_term_meta_should_be_lazy_loaded_for_all_terms_in_wp_query_loop
2435ImagickException: Cannot modify header information - headers already sent by (output started at /tests/phpunit/includes/bootstrap.php:56)
2436
2437/src/wp-includes/class-wp.php:497
2438/src/wp-includes/class-wp.php:725
2439/tests/phpunit/includes/testcase.php:455
2440/tests/phpunit/tests/term/meta.php:127
2441
2442289) Tests_XMLRPC_wp_getMediaItem::test_invalid_username_password
2443ImagickException: exif_read_data(waffles.jpg): Incorrect APP1 Exif Identifier Code
2444
2445/src/wp-admin/includes/image.php:347
2446/src/wp-admin/includes/image.php:130
2447/tests/phpunit/includes/testcase.php:743
2448/tests/phpunit/tests/xmlrpc/wp/getMediaItem.php:26
2449
2450290) Tests_XMLRPC_wp_getMediaItem::test_valid_media_item
2451ImagickException: exif_read_data(waffles.jpg): Incorrect APP1 Exif Identifier Code
2452
2453/src/wp-admin/includes/image.php:347
2454/src/wp-admin/includes/image.php:130
2455/tests/phpunit/includes/testcase.php:743
2456/tests/phpunit/tests/xmlrpc/wp/getMediaItem.php:26
2457--
2458
2459There were 14 failures:
2460
24611) Tests_Locale::test_get_weekday_undefined_index
2462Failed asserting that exception of type "PHPUnit_Framework_Error_Notice" is thrown.
2463
24642) Tests_Media::test_add_image_size
2465Failed asserting that an array does not have the key 'test-size'.
2466
2467/tests/phpunit/tests/media.php:587
2468
24693) Tests_Media::test_wp_calculate_image_srcset
2470Failed asserting that two strings are identical.
2471--- Expected
2472+++ Actual
2473@@ @@
2474-http://example.org/wp-content/uploads/2016/04/test-image-large-300x225.png 300w, http://example.org/wp-content/uploads/2016/04/test-image-large-768x576.png 768w, http://example.org/wp-content/uploads/2016/04/test-image-large-1024x768.png 1024w, http://example.org/wp-content/uploads/2016/04/test-image-large-1200x900.png 1200w, http://example.org/wp-content/uploads/2016/04/test-image-large.png 1600w
2475+http://example.org/wp-content/uploads/2016/04/test-image-large-300x225.png 300w, http://example.org/wp-content/uploads/2016/04/test-image-large-768x576.png 768w, http://example.org/wp-content/uploads/2016/04/test-image-large-1024x768.png 1024w, http://example.org/wp-content/uploads/2016/04/test-image-large-1200x900.png 1200w, http://example.org/wp-content/uploads/2016/04/test-image-large-269x202.png 269w, http://example.org/wp-content/uploads/2016/04/test-image-large.png 1600w
2476
2477/tests/phpunit/tests/media.php:901
2478
24794) Tests_Media::test_wp_calculate_image_srcset_with_absolute_path_in_meta
2480Failed asserting that two strings are identical.
2481--- Expected
2482+++ Actual
2483@@ @@
2484-http://example.org/wp-content/uploads/2016/04/test-image-large-300x225.png 300w, http://example.org/wp-content/uploads/2016/04/test-image-large-768x576.png 768w, http://example.org/wp-content/uploads/2016/04/test-image-large-1024x768.png 1024w, http://example.org/wp-content/uploads/2016/04/test-image-large-1200x900.png 1200w, http://example.org/wp-content/uploads/2016/04/test-image-large.png 1600w
2485+http://example.org/wp-content/uploads/2016/04/test-image-large-300x225.png 300w, http://example.org/wp-content/uploads/2016/04/test-image-large-768x576.png 768w, http://example.org/wp-content/uploads/2016/04/test-image-large-1024x768.png 1024w, http://example.org/wp-content/uploads/2016/04/test-image-large-1200x900.png 1200w, http://example.org/wp-content/uploads/2016/04/test-image-large-269x202.png 269w, http://example.org/wp-content/uploads/2016/04/test-image-large.png 1600w
2486
2487/tests/phpunit/tests/media.php:1026
2488
24895) Tests_Media::test_wp_get_attachment_image_srcset
2490Failed asserting that two strings are identical.
2491--- Expected
2492+++ Actual
2493@@ @@
2494-http://example.org/wp-content/uploads/2016/04/test-image-large.png 1600w, http://example.org/wp-content/uploads/2016/04/test-image-large-300x225.png 300w, http://example.org/wp-content/uploads/2016/04/test-image-large-768x576.png 768w, http://example.org/wp-content/uploads/2016/04/test-image-large-1024x768.png 1024w, http://example.org/wp-content/uploads/2016/04/test-image-large-1200x900.png 1200w
2495+http://example.org/wp-content/uploads/2016/04/test-image-large.png 1600w, http://example.org/wp-content/uploads/2016/04/test-image-large-300x225.png 300w, http://example.org/wp-content/uploads/2016/04/test-image-large-768x576.png 768w, http://example.org/wp-content/uploads/2016/04/test-image-large-1024x768.png 1024w, http://example.org/wp-content/uploads/2016/04/test-image-large-1200x900.png 1200w, http://example.org/wp-content/uploads/2016/04/test-image-large-269x202.png 269w
2496
2497/tests/phpunit/tests/media.php:1255
2498
2499FAILURES!
2500Tests: 6888, Assertions: 19842, Errors: 316, Failures: 14, Skipped: 49.